Peptide,PTM,ModifiedAA,ModifiedPosition,PeptideUniqueToGene,ExperimentDesc,ExpID,PubmedID,ScoreType,IdentScore,LocProb,Log2FChange,PQ-val,QuantSig,PEP,MassErrorPPM
TEAESKTVVPESVLKKR,nt,T,2,true,"Arg/N-end rule pathway Roots",80,25728785,"MASCOT Score",35.3200000,,,,,0.00042200001189485,
TEAESKTVVPESVL,nt,T,2,true,"Arg/N-end rule seed, prt6 vs. Wt",99,29168982,"MASCOT Score",35.6400000,,0.3187499,0.0369381,NO,0.056159999221563,-1.1105873
TEAESKTVVPE,nt,T,2,true,"Arg/N-end rule seed, prt6 vs. Wt",99,29168982,"MASCOT Score",51.7300000,,,,,0.052009999752045,-1.3317323
TEAESKTVVP,nt,T,2,true,"N-term acetylation drought responses",5,26184543,,,,,,,,
TEAESKTVVPESVLKKR,nta,T,2,true,"Arg/N-end rule pathway Roots",80,25728785,"MASCOT Score",55.2100000,,,,,2.2700000954501E-6,
TEAESKTVVPESVLKKR,nta,T,2,true,"FtsH12 N-terminome: WT / FtsH12 knockdown miRNA",118,33216923,"MaxQuant score",46.1310000,,,,,0.098229996860027,
TEAESKTVVPESVLKKR,nta,T,2,true,"HUNTER N-terminome: legumain, GluC and trypsin",119,31951383,"MaxQuant score",96.6660000,,,,,,
TEAESKTVVPESVL,nta,T,2,true,"Arg/N-end rule seed, prt6 vs. Wt",99,29168982,"MASCOT Score",30.1900000,,0.4492731,0.1071704,NO,0.053780000656843,-1.7009974
TEAESKTVVPE,nta,T,2,true,"Arg/N-end rule seed, prt6 vs. Wt",99,29168982,"MASCOT Score",51.7300000,,,,,0.052009999752045,-1.3317323
TEAESKTVVP,nta,T,2,true,"N-term acetylation drought responses",5,26184543,,,,,,,,
ERELIQLKR,ac,K,68,true,"Quantitative Acetylproteomics",101,29440448,,,,,,,,
ELIQLKR,ac,K,68,true,"Quantitative Acetylproteomics",101,29440448,,,,,,,,
LKGGFYVDPEAK,ac,K,74,false,"Quantitative Acetylproteomics",101,29440448,,,,,,,,
AIDPKTKKILQLL,nt,A,96,false,"Arabidopsis translation initiation landscape - NT",167b,35069635,,,,,,,,
QIFNGVFLK,ac,K,120,false,"Quantitative Acetylproteomics",101,29440448,,,,,,,,
RVEPYVTYGYPNLK,ac,K,144,false,"Quantitative Acetylproteomics",101,29440448,,,,,,,,
HYVEGGDAGNR,nt,H,222,false,"Arg/N-end rule seed, prt6 vs. Wt",99,29168982,"MASCOT Score",28.0100000,,,,,0.049649998545647,-1.3448890
