Peptide,PTM,ModifiedAA,ModifiedPosition,PeptideUniqueToGene,ExperimentDesc,ExpID,PubmedID,ScoreType,IdentScore,LocProb,Log2FChange,PQ-val,QuantSig,PEP,MassErrorPPM
GRSYTPSPPRGYGR,ph,S,5,false,"srk2dei ABA signaling phopshoproteomics",83,23572148,"MASCOT Score",30.0000000,,,,,,-0.0002000
GRSYTPSPPRGYGR,ph,S,5,false,"Brassinosteroid-Regulated Phosphorylation Dynamics",94,26187819,"MaxQuant Score",74.0290000,0.9950000,,,,0.0080000003799796,-0.2060000
MRGRSYTPSPPR,ph,S,5,false,"srk2dei ABA signaling phopshoproteomics",83,23572148,"MASCOT Score",20.0000000,,,,,,-0.0006000
GRSYTPSPPR,ph,S,5,false,"LAXIC - mannitol vs control",84b,23660473,XCorr,2.8900000,0.9950000,5.3247245,,NO,1.7399999705958E-5,
GRSYTPSPPR,ph,S,5,false,"SnRK2 protein kinase substrates",85,23776212,XCorr,2.3125329,0.9910000,,,,0.044865798205137,
GRSYTPSPPR,ph,S,5,false,"atm and atr DNA damage response",88,25561503,"MASCOT Score",40.0000000,1.0000000,,,,,0.4100000
GRSYTPSPPR,ph,S,5,false,"TOR Kinase and ABA Receptor",100,29290610,XCorr,3.5562823,0.9505000,,,,0.03889000043273,
GRSYTPSPPR,ph,S,5,false,"Phospho cell culture sucrose/TOR",109,30833711,,,0.9998740,,,,,
GRSYTPSPPR,ph,S,5,false,"Tissue atlas Arabidopsis - ProteomicsDB",114,32188942,"MaxQuant score",134.1300000,0.9998850,,,,0.00022578499920201,
SYTPSPPR,ph,S,5,false,"atm and atr DNA damage response",88,25561503,"MASCOT Score",29.0000000,1.0000000,,,,,0.2100000
GRSYTPSPPRGYGR,ph,Y,6,false,"srk2dei ABA signaling phopshoproteomics",83,23572148,"MASCOT Score",27.0000000,,,,,,-0.0008000
GRSYTPSPPRGYGR,ph,Y,6,false,"SnRK2 protein kinase substrates",85,23776212,XCorr,2.2262757,0.8210000,,,,0.068844802677631,
SYTPSPPRGYGR,ph,Y,6,false,"Col-0 callus - FC Col-0 vs. Col-0 Xray",111a,31410901,,23.8900000,,0.4776365,0.0000000,NO,,1.2007163
SYTPSPPRGYGR,ph,Y,6,false,"Col-0 X-ray callus - FC Col-0 vs. Col-0 Xray",111b,31410901,,23.8900000,,0.4776365,0.0000000,NO,,1.2007163
SYTPSPPRGYGR,ph,Y,6,false,"atm callus - FC atm vs. atm Xray",111c,31410901,,23.8900000,,-0.2135121,0.0000000,NO,,1.2007163
SYTPSPPRGYGR,ph,Y,6,false,"atm-3 X-ray callus - FC atm vs. atm Xray",111d,31410901,,23.8900000,,-0.2135121,0.0000000,NO,,1.2007163
GRSYTPSPPRGYGR,ph,T,7,false,"srk2dei ABA signaling phopshoproteomics",83,23572148,"MASCOT Score",30.0000000,,,,,,-0.0002000
GRSYTPSPPRGYGR,ph,T,7,false,"SnRK2 protein kinase substrates",85,23776212,XCorr,2.2262757,0.8210000,,,,0.068844802677631,
GRSYTPSPPRGYGR,ph,T,7,false,"Brassinosteroid-Regulated Phosphorylation Dynamics",94,26187819,"MaxQuant Score",74.0290000,0.9560000,,,,0.0080000003799796,0.8660000
SYTPSPPRGYGR,ph,T,7,false,"srk2dei ABA signaling phopshoproteomics",83,23572148,"MASCOT Score",26.0000000,,,,,,0.0008000
SYTPSPPRGYGR,ph,T,7,false,"Col-0 callus - FC Col-0 vs. Col-0 Xray",111a,31410901,,23.8900000,,0.4776365,0.0000000,NO,,1.2007163
SYTPSPPRGYGR,ph,T,7,false,"Col-0 X-ray callus - FC Col-0 vs. Col-0 Xray",111b,31410901,,23.8900000,,0.4776365,0.0000000,NO,,1.2007163
SYTPSPPRGYGR,ph,T,7,false,"atm callus - FC atm vs. atm Xray",111c,31410901,,23.8900000,,-0.2135121,0.0000000,NO,,1.2007163
SYTPSPPRGYGR,ph,T,7,false,"atm-3 X-ray callus - FC atm vs. atm Xray",111d,31410901,,23.8900000,,-0.2135121,0.0000000,NO,,1.2007163
MRGRSYTPSPPR,ph,T,7,false,"srk2dei ABA signaling phopshoproteomics",83,23572148,"MASCOT Score",20.0000000,,,,,,-0.0006000
GRSYTPSPPR,ph,T,7,false,"LAXIC - mannitol vs control",84b,23660473,XCorr,2.8900000,0.9950000,5.3247245,,NO,1.7399999705958E-5,
GRSYTPSPPR,ph,T,7,false,"SnRK2 protein kinase substrates",85,23776212,XCorr,2.3125329,0.9910000,,,,0.044865798205137,
GRSYTPSPPR,ph,T,7,false,"atm and atr DNA damage response",88,25561503,"MASCOT Score",40.0000000,1.0000000,,,,,0.4100000
SYTPSPPR,ph,T,7,false,"atm and atr DNA damage response",88,25561503,"MASCOT Score",29.0000000,1.0000000,,,,,0.2100000
SYTPSPPR,ph,T,7,false,"Tissue atlas Arabidopsis - ProteomicsDB",114,32188942,"MaxQuant score",134.1300000,0.9999800,,,,5.1825998525601E-5,
GRSYTPSPPRGYGR,ph,S,9,false,"srk2dei ABA signaling phopshoproteomics",83,23572148,"MASCOT Score",30.0000000,,,,,,-0.0002000
GRSYTPSPPRGYGR,ph,S,9,false,"Brassinosteroid-Regulated Phosphorylation Dynamics",94,26187819,"MaxQuant Score",74.0290000,0.9990000,,,,0.0080000003799796,-0.2060000
SYTPSPPRGYGR,ph,S,9,false,"Conserved plant phosphoproteome - Arabidopsis",61a,20466843,"MASCOT Score",21.0000000,0.8205128,,,,,
SYTPSPPRGYGR,ph,S,9,false,"srk2dei ABA signaling phopshoproteomics",83,23572148,"MASCOT Score",26.0000000,,,,,,0.0008000
SYTPSPPRGYGR,ph,S,9,false,"Col-0 callus - FC Col-0 vs. Col-0 Xray",111a,31410901,,23.8900000,,0.4776365,0.0000000,NO,,1.2007163
SYTPSPPRGYGR,ph,S,9,false,"Col-0 X-ray callus - FC Col-0 vs. Col-0 Xray",111b,31410901,,23.8900000,,0.4776365,0.0000000,NO,,1.2007163
SYTPSPPRGYGR,ph,S,9,false,"atm callus - FC atm vs. atm Xray",111c,31410901,,23.8900000,,-0.2135121,0.0000000,NO,,1.2007163
SYTPSPPRGYGR,ph,S,9,false,"atm-3 X-ray callus - FC atm vs. atm Xray",111d,31410901,,23.8900000,,-0.2135121,0.0000000,NO,,1.2007163
MRGRSYTPSPPR,ph,S,9,false,"srk2dei ABA signaling phopshoproteomics",83,23572148,"MASCOT Score",20.0000000,,,,,,-0.0006000
GRSYTPSPPR,ph,S,9,false,"LAXIC - mannitol vs control",84b,23660473,XCorr,2.8900000,1.0000000,5.3247245,,NO,1.7399999705958E-5,
GRSYTPSPPR,ph,S,9,false,"SnRK2 protein kinase substrates",85,23776212,XCorr,2.3125329,1.0000000,,,,0.044865798205137,
GRSYTPSPPR,ph,S,9,false,"atm and atr DNA damage response",88,25561503,"MASCOT Score",40.0000000,1.0000000,,,,,-0.0100000
GRSYTPSPPR,ph,S,9,false,"TOR Kinase and ABA Receptor",100,29290610,XCorr,3.5562823,0.9505000,,,,0.03889000043273,
SYTPSPPR,ph,S,9,false,"atm and atr DNA damage response",88,25561503,"MASCOT Score",29.0000000,1.0000000,,,,,-0.0600000
SYTPSPPR,ph,S,9,false,"Phospho cell culture sucrose/TOR",109,30833711,,,1.0000000,,,,,
SYTPSPPR,ph,S,9,false,"Tissue atlas Arabidopsis - ProteomicsDB",114,32188942,"MaxQuant score",134.1300000,1.0000000,,,,3.4179400245193E-5,
GRSYTPSPPRGYGR,ph,Y,14,false,"srk2dei ABA signaling phopshoproteomics",83,23572148,"MASCOT Score",23.0000000,,,,,,-0.0004000
GRSYTPSPPRGYGR,ph,Y,14,false,"SnRK2 protein kinase substrates",85,23776212,XCorr,2.2262757,0.8260000,,,,0.068844802677631,
RGRSPSPR,ph,S,20,false,"atm and atr DNA damage response",88,25561503,"MASCOT Score",24.0000000,1.0000000,,,,,-0.1200000
RGRSPSPR,ph,S,22,false,"atm and atr DNA damage response",88,25561503,"MASCOT Score",24.0000000,1.0000000,,,,,-0.1200000
FGGSRDSDLPTSLLVR,ph,S,30,true,"atm and atr DNA damage response",88,25561503,"MASCOT Score",44.0000000,1.0000000,,,,,-0.7800000
FGGSRDSDLPTSLLVR,ph,S,30,true,"TOR Kinase and ABA Receptor",100,29290610,XCorr,3.0231214,0.9051000,,,,0.00034820000291802,
FGGSRDSDLPTSLLVR,ph,S,30,true,"Tissue atlas Arabidopsis - ProteomicsDB",114,32188942,"MaxQuant score",111.6600000,0.9478150,,,,5.9618798786687E-8,
FGGSRDSDLPTSLLVR,ph,S,33,true,"Tissue atlas Arabidopsis - ProteomicsDB",114,32188942,"MaxQuant score",111.6600000,0.8578880,,,,5.9618798786687E-8,
YSRSPPPR,ph,S,148,true,"atm and atr DNA damage response",88,25561503,"MASCOT Score",23.0000000,1.0000000,,,,,0.2000000
YSRSPPPR,ph,S,148,true,"Tissue atlas Arabidopsis - ProteomicsDB",114,32188942,"MaxQuant score",115.2300000,0.9998280,,,,0.0060724201612175,
SRGYNSPPAK,ph,S,161,true,"atm and atr DNA damage response",88,25561503,"MASCOT Score",20.0000000,0.9920000,,,,,0.2100000
SRGYNSPPAK,ph,S,161,true,"Tissue atlas Arabidopsis - ProteomicsDB",114,32188942,"MaxQuant score",81.3270000,0.9998710,,,,0.0020887800492346,
SRGYNSPPAK,ph,S,166,true,"atm and atr DNA damage response",88,25561503,"MASCOT Score",20.0000000,1.0000000,,,,,0.2100000
GYNSPPAKR,ph,S,166,true,"Phosphorylation RNA metabolism",22,16807317,,,,,,,,
GYNSPPAKR,ph,S,166,true,"Chloroplast kinase substrates",60,19376835,"MASCOT Score",41.8300000,,,,,,-1.1063900
GYNSPPAKR,ph,S,166,true,"SnRK2 protein kinase substrates",85,23776212,XCorr,2.7852769,1.0000000,,,,0.0035841099452227,
GYNSPPAKR,ph,S,166,true,"atm and atr DNA damage response",88,25561503,"MASCOT Score",37.0000000,0.9990000,,,,,-0.2600000
GYNSPPAKR,ph,S,166,true,"Phospho cell culture sucrose/TOR",109,30833711,,,1.0000000,,,,,
GYNSPPAKR,ph,S,166,true,"Col-0 callus - FC Col-0 vs. Col-0 Xray",111a,31410901,,46.7300000,,-0.6721479,0.0000000,NO,,-0.2198295
GYNSPPAKR,ph,S,166,true,"Col-0 X-ray callus - FC Col-0 vs. Col-0 Xray",111b,31410901,,46.7300000,,-0.6721479,0.0000000,NO,,-0.2198295
GYNSPPAKR,ph,S,166,true,"atm callus - FC atm vs. atm Xray",111c,31410901,,46.7300000,,-1.1272680,0.0000000,NO,,-0.2198295
GYNSPPAKR,ph,S,166,true,"atm-3 X-ray callus - FC atm vs. atm Xray",111d,31410901,,46.7300000,,-1.1272680,0.0000000,NO,,-0.2198295
GYNSPPAKR,ph,S,166,true,"Tissue atlas Arabidopsis - ProteomicsDB",114,32188942,"MaxQuant score",147.6200000,1.0000000,,,,8.2450402260292E-5,
GYNSPPAK,ph,S,166,true,"Large-scale phosphorylation discovery",44,23111157,XCorr,2.4500000,,,,,,
GYNSPPAK,ph,S,166,true,"Chloroplast kinase substrates",60,19376835,"MASCOT Score",30.3300000,,,,,,-0.3667830
GYNSPPAK,ph,S,166,true,"SnRK2 protein kinase substrates",85,23776212,XCorr,2.0671351,1.0000000,,,,0.12873500585556,
GYNSPPAK,ph,S,166,true,"atm and atr DNA damage response",88,25561503,"MASCOT Score",39.0000000,1.0000000,,,,,-1.8800000
GYNSPPAK,ph,S,166,true,"TOR Kinase and ABA Receptor",100,29290610,XCorr,2.9339623,1.0000000,,,,0.0010669999755919,
HQSRSVSPQDRR,ph,S,174,true,"Phospho cell culture sucrose/TOR",109,30833711,,,1.0000000,,,,,
HQSRSVSPQDRR,ph,S,174,true,"Tissue atlas Arabidopsis - ProteomicsDB",114,32188942,"MaxQuant score",70.1170000,1.0000000,,,,0.0052428399212658,
HQSRSVSPQDR,ph,S,174,true,"Phosphorylation RNA metabolism",22,16807317,,,,,,,,
HQSRSVSPQDR,ph,S,174,true,"atm and atr DNA damage response",88,25561503,"MASCOT Score",27.0000000,1.0000000,,,,,-0.1400000
HQSRSVSPQDR,ph,S,176,true,"Phosphorylation RNA metabolism",22,16807317,,,,,,,,
HQSRSVSPQDR,ph,S,176,true,"atm and atr DNA damage response",88,25561503,"MASCOT Score",27.0000000,1.0000000,,,,,-0.1400000
SVSPQDRR,ph,S,176,true,"Chloroplast kinase substrates",60,19376835,"MASCOT Score",34.1500000,,,,,,-0.7629450
SVSPQDRR,ph,S,176,true,"atm and atr DNA damage response",88,25561503,"MASCOT Score",27.0000000,1.0000000,,,,,-0.0200000
SVSPQDRR,ph,S,176,true,"Col-0 callus - FC Col-0 vs. Col-0 Xray",111a,31410901,,21.5500000,,-1.0956358,0.0000000,NO,,0.0358157
SVSPQDRR,ph,S,176,true,"Col-0 X-ray callus - FC Col-0 vs. Col-0 Xray",111b,31410901,,21.5500000,,-1.0956358,0.0000000,NO,,0.0358157
SVSPQDRR,ph,S,176,true,"atm callus - FC atm vs. atm Xray",111c,31410901,,21.5500000,,,0.0000000,NO,,0.0358157
SVSPQDRR,ph,S,176,true,"Tissue atlas Arabidopsis - ProteomicsDB",114,32188942,"MaxQuant score",70.1170000,1.0000000,,,,0.0052428399212658,
HQSRSVSPQDR,ph,S,178,true,"Phosphorylation RNA metabolism",22,16807317,,,,,,,,
HQSRSVSPQDR,ph,S,178,true,"atm and atr DNA damage response",88,25561503,"MASCOT Score",27.0000000,1.0000000,,,,,-0.1400000
SVSPQDRR,ph,S,178,true,"Chloroplast kinase substrates",60,19376835,"MASCOT Score",34.1500000,,,,,,-0.7629450
SVSPQDRR,ph,S,178,true,"atm and atr DNA damage response",88,25561503,"MASCOT Score",27.0000000,1.0000000,,,,,-0.0200000
SVSPQDRR,ph,S,178,true,"Col-0 callus - FC Col-0 vs. Col-0 Xray",111a,31410901,,21.5500000,,-1.0956358,0.0000000,NO,,0.0358157
SVSPQDRR,ph,S,178,true,"Col-0 X-ray callus - FC Col-0 vs. Col-0 Xray",111b,31410901,,21.5500000,,-1.0956358,0.0000000,NO,,0.0358157
SVSPQDRR,ph,S,178,true,"atm callus - FC atm vs. atm Xray",111c,31410901,,21.5500000,,,0.0000000,NO,,0.0358157
SVSPQDRR,ph,S,178,true,"Tissue atlas Arabidopsis - ProteomicsDB",114,32188942,"MaxQuant score",70.1170000,1.0000000,,,,0.0052428399212658,
ERSYSRSPPHNGSR,ph,S,189,true,"atm and atr DNA damage response",88,25561503,"MASCOT Score",21.0000000,0.9900000,,,,,-0.3500000
ERSYSRSPPHNGSR,ph,S,189,true,"Tissue atlas Arabidopsis - ProteomicsDB",114,32188942,"MaxQuant score",62.5560000,0.9963020,,,,0.0024900899734348,
SYSRSPPHNGSR,ph,S,189,true,"Col-0 callus - FC Col-0 vs. Col-0 Xray",111a,31410901,,21.3400000,,-0.2985327,0.0000000,NO,,0.9993680
SYSRSPPHNGSR,ph,S,189,true,"Col-0 X-ray callus - FC Col-0 vs. Col-0 Xray",111b,31410901,,21.3400000,,-0.2985327,0.0000000,NO,,0.9993680
SYSRSPPHNGSR,ph,S,189,true,"atm callus - FC atm vs. atm Xray",111c,31410901,,21.3400000,,-1.0017133,0.0000000,NO,,0.9993680
SYSRSPPHNGSR,ph,S,189,true,"atm-3 X-ray callus - FC atm vs. atm Xray",111d,31410901,,21.3400000,,-1.0017133,0.0000000,NO,,0.9993680
SYSRSPPHNGSR,ph,Y,190,true,"Col-0 callus - FC Col-0 vs. Col-0 Xray",111a,31410901,,21.3400000,,-0.2985327,0.0000000,NO,,0.9993680
SYSRSPPHNGSR,ph,Y,190,true,"Col-0 X-ray callus - FC Col-0 vs. Col-0 Xray",111b,31410901,,21.3400000,,-0.2985327,0.0000000,NO,,0.9993680
SYSRSPPHNGSR,ph,Y,190,true,"atm callus - FC atm vs. atm Xray",111c,31410901,,21.3400000,,-1.0017133,0.0000000,NO,,0.9993680
SYSRSPPHNGSR,ph,Y,190,true,"atm-3 X-ray callus - FC atm vs. atm Xray",111d,31410901,,21.3400000,,-1.0017133,0.0000000,NO,,0.9993680
ERSYSRSPPHNGSR,ph,S,191,true,"atm and atr DNA damage response",88,25561503,"MASCOT Score",21.0000000,0.9900000,,,,,-0.3500000
ERSYSRSPPHNGSR,ph,S,191,true,"Tissue atlas Arabidopsis - ProteomicsDB",114,32188942,"MaxQuant score",62.5560000,0.9507200,,,,0.0024900899734348,
SYSRSPPHNGSR,ph,S,191,true,"atm and atr DNA damage response",88,25561503,"MASCOT Score",28.0000000,0.9910000,,,,,-0.4900000
ERSYSRSPPHNGSR,ph,S,193,true,"atm and atr DNA damage response",88,25561503,"MASCOT Score",21.0000000,1.0000000,,,,,-0.3500000
ERSYSRSPPHNGSR,ph,S,193,true,"Tissue atlas Arabidopsis - ProteomicsDB",114,32188942,"MaxQuant score",118.5500000,0.9965540,,,,8.5654301074101E-6,
SYSRSPPHNGSR,ph,S,193,true,"atm and atr DNA damage response",88,25561503,"MASCOT Score",28.0000000,1.0000000,,,,,-0.4900000
SYSRSPPHNGSR,ph,S,193,true,"Col-0 callus - FC Col-0 vs. Col-0 Xray",111a,31410901,,21.3400000,,-0.2985327,0.0000000,NO,,0.9993680
SYSRSPPHNGSR,ph,S,193,true,"Col-0 X-ray callus - FC Col-0 vs. Col-0 Xray",111b,31410901,,21.3400000,,-0.2985327,0.0000000,NO,,0.9993680
SYSRSPPHNGSR,ph,S,193,true,"atm callus - FC atm vs. atm Xray",111c,31410901,,21.3400000,,-1.0017133,0.0000000,NO,,0.9993680
SYSRSPPHNGSR,ph,S,193,true,"atm-3 X-ray callus - FC atm vs. atm Xray",111d,31410901,,21.3400000,,-1.0017133,0.0000000,NO,,0.9993680
RSVSPR,ph,S,219,false,"Col-0 callus - FC Col-0 vs. Col-0 Xray",111a,31410901,,22.2200000,,3.3290602,0.0000000,NO,,0.1922488
RSVSPR,ph,S,219,false,"Col-0 X-ray callus - FC Col-0 vs. Col-0 Xray",111b,31410901,,22.2200000,,3.3290602,0.0000000,NO,,0.1922488
RSVSPR,ph,S,221,false,"Col-0 callus - FC Col-0 vs. Col-0 Xray",111a,31410901,,22.2200000,,3.3290602,0.0000000,NO,,0.1922488
RSVSPR,ph,S,221,false,"Col-0 X-ray callus - FC Col-0 vs. Col-0 Xray",111b,31410901,,22.2200000,,3.3290602,0.0000000,NO,,0.1922488
NRSYTPEQARSQSPVPR,ph,S,227,true,"srk2dei ABA signaling phopshoproteomics",83,23572148,"MASCOT Score",28.0000000,,,,,,-0.0006000
NRSYTPEQAR,ph,S,227,true,"LAXIC - mannitol vs control",84b,23660473,XCorr,3.0300000,0.9990000,,,,0.0057915197685361,
NRSYTPEQAR,ph,S,227,true,"atm and atr DNA damage response",88,25561503,"MASCOT Score",29.0000000,1.0000000,,,,,-0.3800000
NRSYTPEQAR,ph,S,227,true,"TOR Kinase and ABA Receptor",100,29290610,XCorr,3.3966420,0.9963000,,,,0.0017409999854863,
NRSYTPEQAR,ph,S,227,true,"Tissue atlas Arabidopsis - ProteomicsDB",114,32188942,"MaxQuant score",191.7800000,0.9999860,,,,2.5490900350606E-34,
SYTPEQAR,ph,S,227,true,"atm and atr DNA damage response",88,25561503,"MASCOT Score",25.0000000,0.9550000,,,,,-0.3500000
SYTPEQAR,ph,S,227,true,"Lateral root-induction - NAA vs control",106,23328941,"MASCOT Score",31.0000000,,,,,,
NRSYTPEQARSQSPVPR,ph,Y,228,true,"srk2dei ABA signaling phopshoproteomics",83,23572148,"MASCOT Score",28.0000000,,,,,,-0.0006000
SYTPEQARSQSPVPR,ph,Y,228,true,"Col-0 callus - FC Col-0 vs. Col-0 Xray",111a,31410901,,31.5000000,,-0.4692075,0.0000000,NO,,1.1533012
SYTPEQARSQSPVPR,ph,Y,228,true,"Col-0 X-ray callus - FC Col-0 vs. Col-0 Xray",111b,31410901,,31.5000000,,-0.4692075,0.0000000,NO,,1.1533012
SYTPEQARSQSPVPR,ph,Y,228,true,"atm callus - FC atm vs. atm Xray",111c,31410901,,31.5000000,,0.6143142,0.0000000,NO,,1.1533012
SYTPEQARSQSPVPR,ph,Y,228,true,"atm-3 X-ray callus - FC atm vs. atm Xray",111d,31410901,,31.5000000,,0.6143142,0.0000000,NO,,1.1533012
SYTPEQARSQSPVPR,ph,Y,228,true,"Tissue atlas Arabidopsis - ProteomicsDB",114,32188942,"MaxQuant score",184.6000000,0.8887510,,,,8.9501102130502E-34,
SYTPEQAR,ph,Y,228,true,"Col-0 callus - FC Col-0 vs. Col-0 Xray",111a,31410901,,28.2200000,,-0.0553313,0.0000000,NO,,0.0176575
SYTPEQAR,ph,Y,228,true,"Col-0 X-ray callus - FC Col-0 vs. Col-0 Xray",111b,31410901,,28.2200000,,-0.0553313,0.0000000,NO,,0.0176575
SYTPEQAR,ph,Y,228,true,"atm callus - FC atm vs. atm Xray",111c,31410901,,28.2200000,,-1.3825841,0.0000000,NO,,0.0176575
SYTPEQAR,ph,Y,228,true,"atm-3 X-ray callus - FC atm vs. atm Xray",111d,31410901,,28.2200000,,-1.3825841,0.0000000,NO,,0.0176575
NRSYTPEQARSQSPVPR,ph,T,229,true,"srk2dei ABA signaling phopshoproteomics",83,23572148,"MASCOT Score",29.0000000,,,,,,-0.0018000
SYTPEQARSQSPVPR,ph,T,229,true,"Col-0 callus - FC Col-0 vs. Col-0 Xray",111a,31410901,,31.5000000,,-0.4692075,0.0000000,NO,,1.1533012
SYTPEQARSQSPVPR,ph,T,229,true,"Col-0 X-ray callus - FC Col-0 vs. Col-0 Xray",111b,31410901,,31.5000000,,-0.4692075,0.0000000,NO,,1.1533012
SYTPEQARSQSPVPR,ph,T,229,true,"atm callus - FC atm vs. atm Xray",111c,31410901,,31.5000000,,0.6143142,0.0000000,NO,,1.1533012
SYTPEQARSQSPVPR,ph,T,229,true,"atm-3 X-ray callus - FC atm vs. atm Xray",111d,31410901,,31.5000000,,0.6143142,0.0000000,NO,,1.1533012
NRSYTPEQAR,ph,T,229,true,"LAXIC - mannitol vs control",84b,23660473,XCorr,3.0300000,0.9770000,,,,0.0057915197685361,
NRSYTPEQAR,ph,T,229,true,"atm and atr DNA damage response",88,25561503,"MASCOT Score",29.0000000,1.0000000,,,,,-0.3800000
SYTPEQAR,ph,T,229,true,"LAXIC - mannitol vs control",84b,23660473,XCorr,2.7200000,1.0000000,,,,0.00501269986853,
SYTPEQAR,ph,T,229,true,"SnRK2 protein kinase substrates",85,23776212,XCorr,2.4281249,0.9940000,,,,0.064957998692989,
SYTPEQAR,ph,T,229,true,"atm and atr DNA damage response",88,25561503,"MASCOT Score",25.0000000,0.9550000,,,,,-0.3500000
SYTPEQAR,ph,T,229,true,"Lateral root-induction - NAA vs control",106,23328941,"MASCOT Score",31.0000000,,,,,,
SYTPEQAR,ph,T,229,true,"Phospho cell culture sucrose/TOR",109,30833711,,,0.9998130,,,,,
SYTPEQAR,ph,T,229,true,"Col-0 callus - FC Col-0 vs. Col-0 Xray",111a,31410901,,28.2200000,,-0.0553313,0.0000000,NO,,0.0176575
SYTPEQAR,ph,T,229,true,"Col-0 X-ray callus - FC Col-0 vs. Col-0 Xray",111b,31410901,,28.2200000,,-0.0553313,0.0000000,NO,,0.0176575
SYTPEQAR,ph,T,229,true,"atm callus - FC atm vs. atm Xray",111c,31410901,,28.2200000,,-1.3825841,0.0000000,NO,,0.0176575
SYTPEQAR,ph,T,229,true,"atm-3 X-ray callus - FC atm vs. atm Xray",111d,31410901,,28.2200000,,-1.3825841,0.0000000,NO,,0.0176575
SYTPEQAR,ph,T,229,true,"Tissue atlas Arabidopsis - ProteomicsDB",114,32188942,"MaxQuant score",191.7800000,1.0000000,,,,2.5490900350606E-34,
SQSPVPRQSRSPTPVPR,ph,S,235,true,"Chloroplast kinase substrates",60,19376835,"MASCOT Score",36.6300000,,,,,,-0.7388500
SQSPVPRQSRSPTPVPR,ph,S,235,true,"srk2dei ABA signaling phopshoproteomics",83,23572148,"MASCOT Score",23.0000000,,,,,,0.0001000
NRSYTPEQARSQSPVPR,ph,S,235,true,"srk2dei ABA signaling phopshoproteomics",83,23572148,"MASCOT Score",29.0000000,,,,,,-0.0018000
SYTPEQARSQSPVPR,ph,S,235,true,"SnRK2 protein kinase substrates",85,23776212,XCorr,3.0322087,0.9980000,,,,0.011494999751449,
SYTPEQARSQSPVPR,ph,S,235,true,"Col-0 callus - FC Col-0 vs. Col-0 Xray",111a,31410901,,31.5000000,,-0.4692075,0.0000000,NO,,1.1533012
SYTPEQARSQSPVPR,ph,S,235,true,"Col-0 X-ray callus - FC Col-0 vs. Col-0 Xray",111b,31410901,,31.5000000,,-0.4692075,0.0000000,NO,,1.1533012
SYTPEQARSQSPVPR,ph,S,235,true,"atm callus - FC atm vs. atm Xray",111c,31410901,,31.5000000,,0.6143142,0.0000000,NO,,1.1533012
SYTPEQARSQSPVPR,ph,S,235,true,"atm-3 X-ray callus - FC atm vs. atm Xray",111d,31410901,,31.5000000,,0.6143142,0.0000000,NO,,1.1533012
SQSPVPRQSRSPTPVPR,ph,S,237,true,"Chloroplast kinase substrates",60,19376835,"MASCOT Score",36.6300000,,,,,,-0.7388500
SQSPVPRQSRSPTPVPR,ph,S,237,true,"srk2dei ABA signaling phopshoproteomics",83,23572148,"MASCOT Score",26.0000000,,,,,,-0.0013000
NRSYTPEQARSQSPVPR,ph,S,237,true,"srk2dei ABA signaling phopshoproteomics",83,23572148,"MASCOT Score",29.0000000,,,,,,-0.0018000
SYTPEQARSQSPVPR,ph,S,237,true,"SnRK2 protein kinase substrates",85,23776212,XCorr,3.0322087,1.0000000,,,,0.011494999751449,
SYTPEQARSQSPVPR,ph,S,237,true,"Col-0 callus - FC Col-0 vs. Col-0 Xray",111a,31410901,,31.5000000,,-0.4692075,0.0000000,NO,,1.1533012
SYTPEQARSQSPVPR,ph,S,237,true,"Col-0 X-ray callus - FC Col-0 vs. Col-0 Xray",111b,31410901,,31.5000000,,-0.4692075,0.0000000,NO,,1.1533012
SYTPEQARSQSPVPR,ph,S,237,true,"atm callus - FC atm vs. atm Xray",111c,31410901,,31.5000000,,0.6143142,0.0000000,NO,,1.1533012
SYTPEQARSQSPVPR,ph,S,237,true,"atm-3 X-ray callus - FC atm vs. atm Xray",111d,31410901,,31.5000000,,0.6143142,0.0000000,NO,,1.1533012
SYTPEQARSQSPVPR,ph,S,237,true,"Tissue atlas Arabidopsis - ProteomicsDB",114,32188942,"MaxQuant score",191.7800000,1.0000000,,,,2.5490900350606E-34,
SQSPVPR,ph,S,237,true,"Phospho cell culture sucrose/TOR",109,30833711,,,0.9994390,,,,,
SQSPVPR,ph,S,237,true,"Col-0 callus - FC Col-0 vs. Col-0 Xray",111a,31410901,,25.7000000,,0.0197190,0.0000000,NO,,0.2383954
SQSPVPR,ph,S,237,true,"Col-0 X-ray callus - FC Col-0 vs. Col-0 Xray",111b,31410901,,25.7000000,,0.0197190,0.0000000,NO,,0.2383954
SQSPVPR,ph,S,237,true,"atm callus - FC atm vs. atm Xray",111c,31410901,,25.7000000,,-0.1443564,0.0000000,NO,,0.2383954
SQSPVPR,ph,S,237,true,"atm-3 X-ray callus - FC atm vs. atm Xray",111d,31410901,,25.7000000,,-0.1443564,0.0000000,NO,,0.2383954
SQSPVPRQSRSPTPVPR,ph,S,243,true,"Chloroplast kinase substrates",60,19376835,"MASCOT Score",36.6300000,,,,,,-0.7388500
SQSPVPRQSRSPTPVPR,ph,S,243,true,"srk2dei ABA signaling phopshoproteomics",83,23572148,"MASCOT Score",26.0000000,,,,,,-0.0013000
SQSPVPRQSRSPTPVPR,ph,S,243,true,"Tissue atlas Arabidopsis - ProteomicsDB",114,32188942,"MaxQuant score",71.2680000,1.0000000,,,,0.0018227399559692,
QSRSPTPVPR,ph,S,243,true,"atm and atr DNA damage response",88,25561503,"MASCOT Score",21.0000000,1.0000000,,,,,0.1000000
QSRSPTPVPR,ph,S,243,true,"Phospho cell culture sucrose/TOR",109,30833711,,,1.0000000,,,,,
SQSPVPRQSRSPTPVPR,ph,S,245,true,"Chloroplast kinase substrates",60,19376835,"MASCOT Score",36.6300000,,,,,,-0.7388500
SQSPVPRQSRSPTPVPR,ph,S,245,true,"srk2dei ABA signaling phopshoproteomics",83,23572148,"MASCOT Score",26.0000000,,,,,,-0.0013000
SQSPVPRQSRSPTPVPR,ph,S,245,true,"Tissue atlas Arabidopsis - ProteomicsDB",114,32188942,"MaxQuant score",117.2500000,1.0000000,,,,0.00039656599983573,
QSRSPTPVPR,ph,S,245,true,"atm and atr DNA damage response",88,25561503,"MASCOT Score",21.0000000,1.0000000,,,,,0.1000000
SQSPVPRQSRSPTPVPR,ph,T,247,true,"srk2dei ABA signaling phopshoproteomics",83,23572148,"MASCOT Score",26.0000000,,,,,,-0.0013000
SQSPVPRQSRSPTPVPR,ph,T,247,true,"Tissue atlas Arabidopsis - ProteomicsDB",114,32188942,"MaxQuant score",117.2500000,1.0000000,,,,0.0018227399559692,
QSRSPTPVPR,ph,T,247,true,"atm and atr DNA damage response",88,25561503,"MASCOT Score",21.0000000,1.0000000,,,,,0.1000000
GAQNGDRSPSQ,ph,S,259,true,"atm and atr DNA damage response",88,25561503,"MASCOT Score",35.0000000,1.0000000,,,,,0.2700000
GAQNGDRSPSQ,ph,S,261,true,"atm and atr DNA damage response",88,25561503,"MASCOT Score",35.0000000,1.0000000,,,,,0.2700000
