Peptide,PTM,ModifiedAA,ModifiedPosition,PeptideUniqueToGene,ExperimentDesc,ExpID,PubmedID,ScoreType,IdentScore,LocProb,Log2FChange,PQ-val,QuantSig,PEP,MassErrorPPM
ASAASSSSSSATTAETSKPSGR,nt,A,46,true,"Arg/N-end rule pathway Roots",80,25728785,"MASCOT Score",39.8000000,,,,,5.7000002016139E-6,
ASAASSSSSSATTAETSKPSGR,nt,A,46,true,"Arabidopsis translation initiation landscape - NT",167b,35069635,,,,,,,,
ASAASSSSSSATTAE,nt,A,46,true,"Arg/N-end rule seed, prt6 vs. Wt",99,29168982,"MASCOT Score",43.5100000,,0.8203425,0.2412406,NO,0.002553999889642,-3.5454807
SAASSSSSSATTAETSKPSGR,nt,S,47,true,"Arg/N-end rule seed, prt6 vs. Wt",99,29168982,"MASCOT Score",22.9900000,,,,,0.12309999763966,-2.0449783
SAASSSSSSATTAE,nt,S,47,true,"Arg/N-end rule seed, prt6 vs. Wt",99,29168982,"MASCOT Score",52.6400000,,0.8825075,0.4188852,NO,2.8469999961089E-5,-2.0514924
SAASSSSSSATTAETSKPSGR,nta,S,47,true,"Arg/N-end rule seed, prt6 vs. Wt",99,29168982,"MASCOT Score",22.9900000,,-0.0797922,0.7645846,NO,0.12309999763966,-2.0449783
AASSSSSSATTAE,nt,A,48,true,"Arg/N-end rule seed, prt6 vs. Wt",99,29168982,"MASCOT Score",75.4700000,,0.5339981,0.2531823,NO,3.6259999092181E-7,-2.0579130
ASSSSSSATTAETSKPSGR,nt,A,49,true,"Arabidopsis translation initiation landscape - NT",167b,35069635,,,,,,,,
HLANGEESDNEIDCVSIAGR,sno,C,135,true,"Site-specific nitrosomeproteomic id - gsnor1-3",90a,25699590,XCorr,3.3700000,,,,,0.034350000321865,-7.0100000
HLANGEESDNEIDCVSIAGR,sno,C,135,true,"Site-specific nitrosomeproteomic id - gsnor1-3",90b,25699590,XCorr,4.6400000,,,,,0.00026319999597035,-5.5200000
SLLPLPDKYHGLTDIDK,ac,K,224,true,"Histone deacetylases substrates - hda14 vs WT",98e,29061669,"MaxQuant Score",70.8000000,1.0000000,2.7730000,0.1028016,NO,6.7000001990891E-8,
SLLPLPDKYHGLTDIDKR,ac,K,233,true,"Quantitative Acetylproteomics",101,29440448,,,,,,,,
IATELHLKR,ac,K,313,true,"Quantitative Acetylproteomics",101,29440448,,,,,,,,
LTIDYQGTEICLERPWR,sno,C,387,true,"Site-specific nitrosomeproteomic id - gsnor1-3",90b,25699590,XCorr,2.4800000,,,,,0.0048239999450743,-7.1500000
RAEAVRESPEPNAK,ph,S,535,true,"TOR Kinase and ABA Receptor",100,29290610,XCorr,3.2718849,1.0000000,,,,0.00035479999496602,
RAEAVRESPEPNAK,ph,S,535,true,"Tissue atlas Arabidopsis - ProteomicsDB",114,32188942,"MaxQuant score",51.5660000,1.0000000,,,,0.0038659800775349,
