Peptide,PTM,ModifiedAA,ModifiedPosition,PeptideUniqueToGene,ExperimentDesc,ExpID,PubmedID,ScoreType,IdentScore,LocProb,Log2FChange,PQ-val,QuantSig,PEP,MassErrorPPM
AAKELHFNKDGTTIRKL,nt,A,51,true,"Arabidopsis translation initiation landscape - NT",167b,35069635,,,,,,,,
AAKELHFNKDGTTIR,nt,A,51,false,"Arg/N-end rule pathway Roots",80,25728785,"MASCOT Score",64.0400000,,,,,8.646999776829E-5,
AAKELHFNKDGTTIR,nt,A,51,false,"Stromal N-terminome",96,26371235,"MASCOT Score",34.6100000,,,,,,
AAKELHFNKDGTTIR,nt,A,51,false,"FtsH12 N-terminome: WT / FtsH12 knockdown miRNA",118,33216923,"MaxQuant score",49.9290000,,,,,0.005226599983871,
AAKELHFNKDGTTIR,nt,A,51,false,"HUNTER N-terminome: legumain, GluC and trypsin",119,31951383,"MaxQuant score",146.7600000,,,,,,
AKELHFNKDGTTIRKL,nt,A,52,true,"Arabidopsis translation initiation landscape - NT",167b,35069635,,,,,,,,
AKELHFNKDGTTIR,nta,A,52,false,"FtsH12 N-terminome: WT / FtsH12 knockdown miRNA",118,33216923,"MaxQuant score",60.5090000,,,,,0.019035000354052,
ELHFNKDGTTIR,ac,K,59,false,"Histone deacetylases substrates - TSA vs control",98b,29061669,"MaxQuant Score",64.3000000,1.0000000,0.1240000,0.9977001,NO,0.00039999998989515,
ELHFNKDGTTIR,ac,K,59,false,"Quantitative Acetylproteomics",101,29440448,,,,,,,,
TGVNKLADLVGVTLGPKGR,nt,T,69,true,"Stromal N-terminome",96,26371235,"MASCOT Score",56.8500000,,,,,,
LADLVGVTLGPKGR,nt,L,74,false,"Stromal N-terminome",96,26371235,"MASCOT Score",41.2500000,,,,,,
LADLVGVTLGPKGR,ac,K,85,false,"Quantitative Acetylproteomics",101,29440448,,,,,,,,
NVVLESKYGSPR,ac,K,94,false,"Histone deacetylases - apicidin vs control",98a,29061669,"MaxQuant Score",88.1000000,1.0000000,0.1790000,0.5445027,NO,2.6999998681276E-7,
NVVLESKYGSPR,ac,K,94,false,"Histone deacetylases substrates - TSA vs control",98b,29061669,"MaxQuant Score",88.1000000,1.0000000,-0.0020000,0.9977001,NO,2.6999998681276E-7,
NVVLESKYGSPR,ac,K,94,false,"Histone deacetylases substrates - hda14 vs WT",98e,29061669,"MaxQuant Score",88.1000000,1.0000000,0.6330000,0.2517677,NO,6.4999999267457E-6,
EVELEDPVENIGAKLVR,nt,E,110,false,"Metacaspase9 substrates - Col-0 / mc9",51a,23964026,"MASCOT Score",55.0000000,,3.1841684,,NO,,-1.2152861
EVELEDPVENIGAKLVR,nt,E,110,false,"Metacaspase9 substrates - 35S:MC9 / mc9",51b,23964026,"MASCOT Score",58.0000000,,3.6692754,,NO,,-1.2152861
EVELEDPVENIGAKLVR,nt,E,110,false,"Stromal N-terminome",96,26371235,"MASCOT Score",49.3500000,,,,,,
EVELEDPVENIGAKLVR,nt,E,110,false,"Arabidopsis translation initiation landscape - NT",167b,35069635,,,,,,,,
EVELEDPVENIGAKLVR,ub,K,123,false,"Arabidopsis ubiquitination COFRADIC",40,26744219,"MaxQuant Score",123.0200000,1.0000000,,,,1.5430000018837E-29,0.1500000
DLAGDGTTTSVVLAQGFIAE,nt,D,134,false,"Arg/N-end rule seed, prt6 vs. Wt",99,29168982,"MASCOT Score",21.1500000,,-0.9190801,0.0762136,NO,0.00027210000553168,0.9343277
VVEGMQFDR,nt,V,239,false,"Arg/N-end rule seed, prt6 vs. Wt",99,29168982,"MASCOT Score",20.8600000,,-0.1535073,0.8056290,NO,0.20299999415874,-0.5536685
GYISPYFVTDSEK,ph,S,258,false,"srk2dei ABA signaling phopshoproteomics",83,23572148,"MASCOT Score",41.0000000,,,,,,0.0015000
GYISPYFVTDSEK,ph,S,258,false,"TOR Kinase and ABA Receptor",100,29290610,XCorr,3.2722793,0.9192000,,,,0.00081729999510571,
GYISPYFVTDSEK,ph,S,258,false,"Phospho cell culture sucrose/TOR",109,30833711,,,0.8259050,,,,,
MSVEYDNCK,sno,C,268,true,"hot5-4 / wildtype, FAT-switch S-nitrosoproteome",169,37277371,,,,1.0825600,0.0030623,YES,,
MSVEYDNCK,so,C,268,true,"Arabidopsis S-sulfenylation chemoproteomics",108,31578252,"pFind PSM Score",0.2311000,,,,,,-1.1403402
MSVEYDNCK,so,C,268,true,"S-sulfenylation site detection using YAP1C",110,32714340,,,,,,,,
DLVGVLEDAIR,nt,D,282,false,"Metacaspase9 substrates - in vitro rMC9",51c,23964026,"MASCOT Score",98.0000000,,3.9189277,,NO,,-0.4729257
DLVGVLEDAIR,nt,D,282,false,"Stromal N-terminome",96,26371235,"MASCOT Score",80.8700000,,,,,,
TLKIAALKAPGFGER,nta,T,320,true,"Arabidopsis translation initiation landscape - NTA",167a,35069635,,,,,,,,
ILTGATVIR,nt,I,344,false,"Arg/N-end rule seed, prt6 vs. Wt",99,29168982,"MASCOT Score",24.5800000,,-1.1148377,0.1807888,NO,0.20370000600815,-0.6910791
EEVGLSLDK,ph,S,358,false,"SIRK1 exp - sirk1 mutant vs WT",86b,23820729,,,,-0.3343642,,NO,,
EMTTIVGDGTTQEAVNKR,nt,E,378,true,"Metacaspase9 substrates - Col-0 / mc9",51a,23964026,"MASCOT Score",61.0000000,,,,,,-2.6975052
EMTTIVGDGTTQEAVNKR,nt,E,378,true,"Metacaspase9 substrates - in vitro rMC9",51c,23964026,"MASCOT Score",115.0000000,,2.0949332,,NO,,-0.7125780
EMTTIVGDGTTQEAVNK,mox,M,379,true,"cat2 Methionine oxidation - 1h stress",62a,25693801,"MASCOT Score",78.0000000,,0.2014589,,NO,,
EMTTIVGDGTTQEAVNKR,ac,K,394,true,"Quantitative Acetylproteomics",101,29440448,,,,,,,,
NLIEQAEQDYEKEKLNER,ub,K,412,false,"Arabidopsis ubiquitination COFRADIC",40,26744219,"MaxQuant Score",41.5130000,0.9190000,,,,5.0610000471352E-5,2.5690000
VIQVGAQTE,nt,V,428,false,"Arg/N-end rule seed, prt6 vs. Wt",99,29168982,"MASCOT Score",36.7900000,,0.1992736,0.5705263,NO,0.020530000329018,1.6103023
AAVEEGIVVGGGCTLLR,acy,C,467,false,"Arabidopsis S-acylation atlas - Meristem",163a,35681017,,,,,,,,
AAVEEGIVVGGGCTLLR,sno,C,467,false,"Site-specific nitrosomeproteomic id - gsnor1-3",90b,25699590,XCorr,3.2652442,,,,,0.11959999799728,-7.2060530
AAVEEGIVVGGGCTLLR,sno,C,467,false,"hot5-4 / wildtype, FAT-switch S-nitrosoproteome",169,37277371,,,,,,,,
AAVEEGIVVGGGCTLLR,so,C,467,false,"Arabidopsis S-sulfenylation chemoproteomics",108,31578252,"pFind PSM Score",0.0001313,,1.7948700,,,,-1.4442243
AAVEEGIVVGGGCTLLR,so,C,467,false,"S-sulfenylation site detection using YAP1C",110,32714340,,,,,,,,
LASKVDAIKDTLENDEEK,ph,S,474,true,"STN8 phosphoproteome",38,21768351,"MASCOT Score",54.9000000,,,,,,0.5714670
LASKVDAIKDTLENDEEK,ph,S,474,true,"Chloroplast kinase substrates",60,19376835,"MASCOT Score",53.7500000,,,,,,0.5714670
LASKVDAIKDTLENDEEK,ph,S,474,true,"Tissue atlas Arabidopsis - ProteomicsDB",114,32188942,"MaxQuant score",164.3100000,1.0000000,,,,1.3443599677176E-22,
LASKVDAIK,ph,S,474,false,"Phosphoproteome ethylene-regulated time response",46,24043427,"MASCOT Score",42.7300000,,,,,,33.7707000
LASKVDAIK,ph,S,474,false,"Tyrosine phosphorylation in Arabidopsis",59,18463617,"MASCOT Score",24.0000000,,,,,,-0.6839037
LASKVDAIK,ph,S,474,false,"srk2dei ABA signaling phopshoproteomics",83,23572148,"MASCOT Score",40.0000000,,,,,,-0.0004000
LASKVDAIK,ph,S,474,false,"LAXIC - mannitol vs control",84b,23660473,XCorr,2.0600000,1.0000000,,,,0.0016027300152928,
LASKVDAIK,ph,S,474,false,"SnRK2 protein kinase substrates",85,23776212,XCorr,2.6837683,1.0000000,,,,3.7346200087995E-7,
LASKVDAIK,ph,S,474,false,"atm and atr DNA damage response",88,25561503,"MASCOT Score",43.0000000,1.0000000,,,,,-3.4800000
LASKVDAIK,ph,S,474,false,"Tissue atlas Arabidopsis - ProteomicsDB",114,32188942,"MaxQuant score",126.1200000,1.0000000,,,,2.0740799355767E-10,
LASKVDAIKDTLENDEEK,ac,K,475,true,"Quantitative Acetylproteomics",101,29440448,,,,,,,,
LASKVDAIK,ac,K,475,false,"Quantitative Acetylproteomics",101,29440448,,,,,,,,
VDAIKDTLENDEEK,ph,T,482,true,"SIRK1 phosphorylation",86a,23820729,"MaxQuant Score",103.5300000,1.0000000,,,,0.20000000298023,4.9180000
VDAIKDTLENDEEK,ph,T,482,true,"SIRK1 exp - sirk1 mutant vs WT",86b,23820729,,,,1.0074349,,NO,,
VDAIKDTLENDEEK,ph,T,482,true,"SIRK1 exp - 35S:SIRK1 vs WT",86c,23820729,,,,0.7369460,,NO,,
VGAEIVKR,ac,K,496,true,"Quantitative Acetylproteomics",101,29440448,,,,,,,,
ALSYPLKLIAK,ac,K,504,false,"Histone deacetylases - apicidin vs control",98a,29061669,"MaxQuant Score",92.6000000,1.0000000,0.4590000,0.1770109,NO,0.012000000104308,
ALSYPLKLIAK,ac,K,504,false,"Quantitative Acetylproteomics",101,29440448,,,,,,,,
LIAKNAGVNGSVVSEK,ac,K,508,false,"Quantitative Acetylproteomics",101,29440448,,,,,,,,
NAGVNGSVVSEK,ng,N,513,false,"Conserved N-glycosylation",74,22633491,"MaxQuant Score",76.8240000,1.0000000,,,,0.0010000000474975,-3.5130000
NAGVNGSVVSEK,ph,S,515,false,"Lateral root-induction - NAA vs control",106,23328941,"MASCOT Score",28.0000000,,,,,,
NAGVNGSVVSEK,ph,S,515,false,"Tissue atlas Arabidopsis - ProteomicsDB",114,32188942,"MaxQuant score",153.2200000,0.9999620,,,,1.3569899692811E-7,
YEDLMAAGIIDPTK,mox,M,542,false,"cat2 Methionine oxidation - 3h stress",62b,25693801,"MASCOT Score",36.0000000,,0.1521109,,NO,,
CCLEHAASVAK,ox,C,555,false,"SPEAR - 10 mM H2O2 / mock",138a,34619326,,,,1.2388848,0.0316486,YES,,
CCLEHAASVAK,ox,C,555,false,"SPEAR - 50 mM H2O2 / mock",138b,34619326,,,,0.6739217,0.0366101,YES,,
CCLEHAASVAK,so,C,555,false,"Arabidopsis S-sulfenylation chemoproteomics",108,31578252,"pFind PSM Score",0.0000383,,1.0262900,,,,-0.6393005
CCLEHAASVAK,so,C,555,false,"S-sulfenylation site detection using YAP1C",110,32714340,,,,,,,,
CCLEHAASVAK,so,C,556,false,"Arabidopsis S-sulfenylation chemoproteomics",108,31578252,"pFind PSM Score",0.0000383,,1.0967000,,,,-0.6393005
CCLEHAASVAK,ph,S,562,false,"srk2dei ABA signaling phopshoproteomics",83,23572148,"MASCOT Score",54.0000000,,,,,,0.0001000
CCLEHAASVAK,ph,S,562,false,"Phospho cell culture sucrose/TOR",109,30833711,,,1.0000000,,,,,
CCLEHAASVAK,ph,S,562,false,"Tissue atlas Arabidopsis - ProteomicsDB",114,32188942,"MaxQuant score",201.0400000,1.0000000,,,,9.2203399500585E-20,
