Peptide,PTM,ModifiedAA,ModifiedPosition,PeptideUniqueToGene,ExperimentDesc,ExpID,PubmedID,ScoreType,IdentScore,LocProb,Log2FChange,PQ-val,QuantSig,PEP,MassErrorPPM
ASSPGNTNPHNPPPFD,nta,A,2,true,"Arabidopsis translation initiation landscape - NTA",167a,35069635,,,,,,,,
TLSYPTPPLNPQSPR,og,T,79,true,"O-GlcNac Inflorescence Tissue",81,28154133,"MASCOT Score",25.1000000,,,,,,1.3000000
TLSYPTPPLNPQSPR,ph,S,81,true,"Tissue atlas Arabidopsis - ProteomicsDB",114,32188942,"MaxQuant score",154.3100000,0.9993850,,,,3.3910201036047E-12,
TLSYPTPPLNPQSPR,ph,T,84,true,"Tissue atlas Arabidopsis - ProteomicsDB",114,32188942,"MaxQuant score",138.7300000,0.9402960,,,,4.4805898857605E-16,
TLSYPTPPLNPQSPR,ph,S,91,true,"Mitochondrial phosphoproteome",32,19688752,"MASCOT Score",22.4000000,,,,,,10.8406000
TLSYPTPPLNPQSPR,ph,S,91,true,"STN8 phosphoproteome",38,21768351,"MASCOT Score",56.0900000,,,,,,-1.2930700
TLSYPTPPLNPQSPR,ph,S,91,true,"Chloroplast kinase substrates",60,19376835,"MASCOT Score",90.2000000,,,,,,-0.6640840
TLSYPTPPLNPQSPR,ph,S,91,true,"Conserved plant phosphoproteome - Arabidopsis",61a,20466843,"MASCOT Score",43.0000000,1.0000000,,,,,
TLSYPTPPLNPQSPR,ph,S,91,true,"srk2dei ABA signaling phopshoproteomics",83,23572148,"MASCOT Score",66.0000000,,,,,,0.0002000
TLSYPTPPLNPQSPR,ph,S,91,true,"atm and atr DNA damage response",88,25561503,"MASCOT Score",43.0000000,1.0000000,,,,,0.0300000
TLSYPTPPLNPQSPR,ph,S,91,true,"TOR Kinase and ABA Receptor",100,29290610,XCorr,4.0522118,1.0000000,,,,1.4159999750518E-7,
TLSYPTPPLNPQSPR,ph,S,91,true,"Lateral root-induction - NAA vs control",106,23328941,"MASCOT Score",54.0000000,,0.0413150,0.9328562,NO,,
TLSYPTPPLNPQSPR,ph,S,91,true,"Phospho cell culture sucrose/TOR",109,30833711,,,0.9999790,,,,,
TLSYPTPPLNPQSPR,ph,S,91,true,"Col-0 callus - FC Col-0 vs. Col-0 Xray",111a,31410901,,72.9200000,,0.7571278,0.0000000,NO,,1.0509044
TLSYPTPPLNPQSPR,ph,S,91,true,"Col-0 X-ray callus - FC Col-0 vs. Col-0 Xray",111b,31410901,,72.9200000,,0.7571278,0.0000000,NO,,1.0509044
TLSYPTPPLNPQSPR,ph,S,91,true,"atm callus - FC atm vs. atm Xray",111c,31410901,,72.9200000,,0.5381352,0.0000000,NO,,1.0509044
TLSYPTPPLNPQSPR,ph,S,91,true,"atm-3 X-ray callus - FC atm vs. atm Xray",111d,31410901,,72.9200000,,0.5381352,0.0000000,NO,,1.0509044
TLSYPTPPLNPQSPR,ph,S,91,true,"Tissue atlas Arabidopsis - ProteomicsDB",114,32188942,"MaxQuant score",223.3400000,1.0000000,,,,0,
TLSYPTPPLNPQSPR,ph,S,91,true,"Touch-induced phosphorylation: 40s touch vs untouc",136,30291188,"MASCOT score",76.0200000,,0.0551123,0.8007355,NO,,1.6025513
AFPGGSGPIHVPSGK,ph,S,131,true,"LAXIC - mannitol vs control",84b,23660473,XCorr,2.3100000,1.0000000,,,,0.078453898429871,
AFPGGSGPIHVPSGK,ph,S,131,true,"atm and atr DNA damage response",88,25561503,"MASCOT Score",42.0000000,1.0000000,,,,,1.0100000
AFPGGSGPIHVPSGK,ph,S,131,true,"Tissue atlas Arabidopsis - ProteomicsDB",114,32188942,"MaxQuant score",147.1200000,1.0000000,,,,1.4108199941631E-8,
AFPGGSGPIHVPSGK,ph,S,138,true,"LAXIC - mannitol vs control",84b,23660473,XCorr,2.3100000,1.0000000,,,,0.078453898429871,
AFPGGSGPIHVPSGK,ph,S,138,true,"Tissue atlas Arabidopsis - ProteomicsDB",114,32188942,"MaxQuant score",131.8400000,1.0000000,,,,1.5199799463517E-6,
ISEGSEGDEQSQITGK,ph,S,255,true,"Tissue atlas Arabidopsis - ProteomicsDB",114,32188942,"MaxQuant score",91.4010000,0.9803130,,,,9.213900193572E-5,
IVVALQILGEEDTK,ph,T,279,true,"Lateral root-induction - NAA vs control",106,23328941,"MASCOT Score",21.0000000,,,,,,
CTQTLDLK,so,C,436,false,"S-sulfenylation site detection using YAP1C",110,32714340,,,,,,,,
EANLVESTLETSGMKPTELPSVGSVPKPSILVNR,ph,S,583,true,"Tissue atlas Arabidopsis - ProteomicsDB",114,32188942,"MaxQuant score",358.4000000,0.9824600,,,,0,
TSGMPSETSDVDSAYAPSPQLPLSPR,ph,S,648,true,"LAXIC - ABA stress",84a,23660473,XCorr,4.2700000,0.9990000,,,,1.3300000034633E-7,
TSGMPSETSDVDSAYAPSPQLPLSPR,ph,S,648,true,"SnRK2 protein kinase substrates",85,23776212,XCorr,3.8360894,1.0000000,,,,0.0011235700221732,
TSGMPSETSDVDSAYAPSPQLPLSPR,ph,S,648,true,"TOR Kinase and ABA Receptor",100,29290610,XCorr,6.0091934,1.0000000,,,,1.6699999605407E-7,
TSGMPSETSDVDSAYAPSPQLPLSPR,ph,S,648,true,"Lateral root-induction - NAA vs control",106,23328941,"MASCOT Score",50.0000000,,-0.0385488,0.7842821,NO,,
TSGMPSETSDVDSAYAPSPQLPLSPR,ph,S,648,true,"Tissue atlas Arabidopsis - ProteomicsDB",114,32188942,"MaxQuant score",88.5440000,0.9975060,,,,9.9783996373288E-16,
TSGMPSETSDVDSAYAPSPQLPLSPR,ph,S,648,true,"Touch-induced phosphorylation: 40s touch vs untouc",136,30291188,"MASCOT score",113.5100000,,-0.0436404,0.8115493,NO,,6.3297063
LSGYHTPVEAFEQVLPHHK,ph,S,656,true,"TOR Kinase and ABA Receptor",100,29290610,XCorr,3.0500515,0.8487000,,,,0.00047589998575859,
LSGYHTPVEAFEQVLPHHK,ph,T,660,true,"Tissue atlas Arabidopsis - ProteomicsDB",114,32188942,"MaxQuant score",123.3600000,0.9649310,,,,6.597460087578E-22,
TSSADYFYVR,ph,S,679,true,"Tissue atlas Arabidopsis - ProteomicsDB",114,32188942,"MaxQuant score",115.4100000,0.9633410,,,,0.00018477000412531,
TSSADYFYVR,ph,S,680,true,"srk2dei ABA signaling phopshoproteomics",83,23572148,"MASCOT Score",49.0000000,,,,,,0.0025000
TSSADYFYVR,ph,S,680,true,"LAXIC - mannitol vs control",84b,23660473,XCorr,2.7200000,0.9980000,SINGLETON_UP,0.0000000,YES,0.004135400056839,
TSSADYFYVR,ph,S,680,true,"atm and atr DNA damage response",88,25561503,"MASCOT Score",43.0000000,0.9320000,,,,,-0.4300000
TSSADYFYVR,ph,S,680,true,"TOR Kinase and ABA Receptor",100,29290610,XCorr,3.2059581,0.9750000,,,,0.00022529999841936,
TSSADYFYVR,ph,S,680,true,"Lateral root-induction - NAA vs control",106,23328941,"MASCOT Score",25.0000000,,,,,,
TSSADYFYVR,ph,S,680,true,"Phospho cell culture sucrose/TOR",109,30833711,,,0.9995890,,,,,
TSSADYFYVR,ph,S,680,true,"Tissue atlas Arabidopsis - ProteomicsDB",114,32188942,"MaxQuant score",152.0700000,0.9998720,,,,8.3643402604139E-7,
NLDVSSVEENCR,ph,S,700,true,"Tissue atlas Arabidopsis - ProteomicsDB",114,32188942,"MaxQuant score",192.3500000,0.9978460,,,,2.6097199018439E-24,
NLDVSSVEENCR,ph,S,701,true,"Tissue atlas Arabidopsis - ProteomicsDB",114,32188942,"MaxQuant score",228.6200000,0.9990250,,,,0,
NLDVSSVEENCR,ox,C,706,true,"OxiTRAQ Arabidopsis - 5 mM H2O2 versus control",47,24376095,,,,-0.3262867,0.0856310,NO,,
SKDTNVTPDDDVSGIR,ph,T,714,true,"Tissue atlas Arabidopsis - ProteomicsDB",114,32188942,"MaxQuant score",157.0800000,1.0000000,,,,1.0652600300355E-37,
DTNVTPDDDVSGIRSPSAFFK,ph,S,720,true,"srk2dei ABA signaling phopshoproteomics",83,23572148,"MASCOT Score",54.0000000,,,,,,0.0013000
DTNVTPDDDVSGIRSPSAFFK,ph,S,720,true,"TOR Kinase and ABA Receptor",100,29290610,XCorr,3.7431874,0.8834000,,,,0.0039249998517334,
DTNVTPDDDVSGIRSPSAFFK,ph,S,720,true,"Phospho cell culture sucrose/TOR",109,30833711,,,0.8418680,,,,,
DTNVTPDDDVSGIRSPSAFFK,ph,S,720,true,"Tissue atlas Arabidopsis - ProteomicsDB",114,32188942,"MaxQuant score",197.5600000,0.9488910,,,,0,
SKDTNVTPDDDVSGIRSPSAFFK,ph,S,724,true,"SnRK2 protein kinase substrates",85,23776212,XCorr,3.8100665,0.9210000,,,,3.96250006599E-16,
DTNVTPDDDVSGIRSPSAFFK,ph,S,724,true,"srk2dei ABA signaling phopshoproteomics",83,23572148,"MASCOT Score",41.0000000,,,,,,0.0017000
DTNVTPDDDVSGIRSPSAFFK,ph,S,724,true,"Tissue atlas Arabidopsis - ProteomicsDB",114,32188942,"MaxQuant score",385.3300000,0.9989950,,,,0,
SPSAFFK,ph,S,724,false,"Phospho cell culture sucrose/TOR",109,30833711,,,0.8681640,,,,,
SPSAFFK,ph,S,724,false,"Col-0 callus - FC Col-0 vs. Col-0 Xray",111a,31410901,,37.9100000,,-0.6556188,0.0000000,NO,,-1.9931223
SPSAFFK,ph,S,724,false,"Col-0 X-ray callus - FC Col-0 vs. Col-0 Xray",111b,31410901,,37.9100000,,-0.6556188,0.0000000,NO,,-1.9931223
SPSAFFK,ph,S,724,false,"atm callus - FC atm vs. atm Xray",111c,31410901,,37.9100000,,-0.7188763,0.0000000,NO,,-1.9931223
SPSAFFK,ph,S,724,false,"atm-3 X-ray callus - FC atm vs. atm Xray",111d,31410901,,37.9100000,,-0.7188763,0.0000000,NO,,-1.9931223
SPSAFFK,ph,S,726,false,"Pollen phosphoproteome Arabidopsis",43,22631563,"MASCOT Score",53.7800000,,,,,,-1.5113600
SPSAFFK,ph,S,726,false,"srk2dei ABA signaling phopshoproteomics",83,23572148,"MASCOT Score",59.0000000,,,,,,0.0002000
SPSAFFK,ph,S,726,false,"Phospho cell culture sucrose/TOR",109,30833711,,,0.8640460,,,,,
SPSAFFK,ph,S,726,false,"Tissue atlas Arabidopsis - ProteomicsDB",114,32188942,"MaxQuant score",160.7400000,0.9999850,,,,8.4038697423239E-7,
ENIFCSQASNLSTEMAR,ph,S,812,true,"Tissue atlas Arabidopsis - ProteomicsDB",114,32188942,"MaxQuant score",198.5100000,0.9999900,,,,1.4446798621834E-39,
ENIFCSQASNLSTEMAR,ph,S,815,true,"srk2dei ABA signaling phopshoproteomics",83,23572148,"MASCOT Score",72.0000000,,,,,,-0.0007000
ENIFCSQASNLSTEMAR,ph,S,815,true,"atm and atr DNA damage response",88,25561503,"MASCOT Score",39.0000000,1.0000000,,,,,-0.3300000
ENIFCSQASNLSTEMAR,ph,S,815,true,"Lateral root-induction - NAA vs control",106,23328941,"MASCOT Score",44.0000000,,,,,,
ENIFCSQASNLSTEMAR,ph,S,815,true,"Tissue atlas Arabidopsis - ProteomicsDB",114,32188942,"MaxQuant score",297.1700000,0.9999910,,,,0,
ENIFCSQASNLSTEMAR,ph,S,818,true,"Tyrosine phosphorylation in Arabidopsis",59,18463617,"MASCOT Score",42.0000000,,,,,,-0.6873420
ENIFCSQASNLSTEMAR,ph,S,818,true,"srk2dei ABA signaling phopshoproteomics",83,23572148,"MASCOT Score",49.0000000,,,,,,-0.0002000
ENIFCSQASNLSTEMAR,ph,S,818,true,"SnRK2 protein kinase substrates",85,23776212,XCorr,3.7431102,0.9590000,,,,4.9257198497799E-7,
ENIFCSQASNLSTEMAR,ph,S,818,true,"atm and atr DNA damage response",88,25561503,"MASCOT Score",39.0000000,0.9570000,,,,,-0.3300000
ENIFCSQASNLSTEMAR,ph,S,818,true,"Lateral root-induction - NAA vs control",106,23328941,"MASCOT Score",57.0000000,,,,,,
ENIFCSQASNLSTEMAR,ph,S,818,true,"Phospho cell culture sucrose/TOR",109,30833711,,,0.8418350,,,,,
ENIFCSQASNLSTEMAR,ph,S,818,true,"Tissue atlas Arabidopsis - ProteomicsDB",114,32188942,"MaxQuant score",359.6000000,0.8849650,,,,0,
DRHPITEGSAIPGDSMAYGQPLQAGDER,nt,D,824,true,"Arabidopsis translation initiation landscape - NT",167b,35069635,,,,,,,,
DRHPITEGSAIPGDSMAYGQPLQAGDER,ph,S,832,true,"Tissue atlas Arabidopsis - ProteomicsDB",114,32188942,"MaxQuant score",152.0500000,0.9400820,,,,0,
GLDSRDVSAK,ph,S,855,true,"Tissue atlas Arabidopsis - ProteomicsDB",114,32188942,"MaxQuant score",84.3520000,0.9969400,,,,0.003879559924826,
LPESGSSSGLVATNSK,ph,S,867,true,"atm and atr DNA damage response",88,25561503,"MASCOT Score",42.0000000,0.9940000,,,,,0.3500000
LPESGSSSGLVATNSK,ph,S,867,true,"Tissue atlas Arabidopsis - ProteomicsDB",114,32188942,"MaxQuant score",373.6500000,0.9970220,,,,0,
LPESGSSSGLVATNSK,ph,S,868,true,"atm and atr DNA damage response",88,25561503,"MASCOT Score",30.0000000,0.9450000,,,,,0.7300000
LPESGSSSGLVATNSK,ph,S,868,true,"Tissue atlas Arabidopsis - ProteomicsDB",114,32188942,"MaxQuant score",133.2500000,0.8380420,,,,2.9272299280762E-16,
LPESGSSSGLVATNSK,ph,T,874,true,"Tissue atlas Arabidopsis - ProteomicsDB",114,32188942,"MaxQuant score",343.6900000,0.9930700,,,,0,
LPESGSSSGLVATNSK,ph,S,876,true,"atm and atr DNA damage response",88,25561503,"MASCOT Score",49.0000000,1.0000000,,,,,-0.1300000
LPESGSSSGLVATNSK,ph,S,876,true,"Tissue atlas Arabidopsis - ProteomicsDB",114,32188942,"MaxQuant score",339.1800000,0.9999940,,,,0,
TVSSAITESFQR,ph,S,1044,false,"Tissue atlas Arabidopsis - ProteomicsDB",114,32188942,"MaxQuant score",201.0400000,0.9982900,,,,9.1757502504285E-26,
IDSGQSQLAHTLR,ph,S,1139,true,"Tissue atlas Arabidopsis - ProteomicsDB",114,32188942,"MaxQuant score",159.1300000,0.9999990,,,,4.7428699856411E-10,
ETISSASSVTQALNR,ph,S,1153,true,"Tissue atlas Arabidopsis - ProteomicsDB",114,32188942,"MaxQuant score",257.1500000,0.9992690,,,,0,
ETISSASSVTQALNR,ph,S,1157,true,"Tissue atlas Arabidopsis - ProteomicsDB",114,32188942,"MaxQuant score",251.8700000,0.9610380,,,,0,
LALTAAGSNPLVTQLSNGPLGALLEK,ph,S,1189,true,"STN8 phosphoproteome",38,21768351,"MASCOT Score",100.7000000,,,,,,-1.5149400
LALTAAGSNPLVTQLSNGPLGALLEK,ph,S,1189,true,"TOR Kinase and ABA Receptor",100,29290610,XCorr,3.6407123,1.0000000,,,,0.00028249999741092,
