Peptide,PTM,ModifiedAA,ModifiedPosition,PeptideUniqueToGene,ExperimentDesc,ExpID,PubmedID,ScoreType,IdentScore,LocProb,Log2FChange,PQ-val,QuantSig,PEP,MassErrorPPM
SLGTDGHQVECR,fuc,S,161,true,"SPINDLY O-fucosylation",162,36739885,,,,,,,0.61000001430511,
SAVMDEPETNKSPPKEK,ph,T,295,true,"Tissue atlas Arabidopsis - ProteomicsDB",114,32188942,"MaxQuant score",74.0290000,0.7844260,,,,0.00025099699269049,
SAVMDEPETNKSPPKEK,ph,S,298,true,"Phospho cell culture sucrose/TOR",109,30833711,,,0.7695390,,,,,
SAVMDEPETNKSPPKEK,ph,S,298,true,"Tissue atlas Arabidopsis - ProteomicsDB",114,32188942,"MaxQuant score",167.5900000,0.9994250,,,,2.7051401067318E-22,
SAVMDEPETNKSPPK,ph,S,298,true,"TOR Kinase and ABA Receptor",100,29290610,XCorr,4.3522520,0.9151000,,,,0.00024540000595152,
LVADANTESESEDSER,ph,T,310,true,"Tissue atlas Arabidopsis - ProteomicsDB",114,32188942,"MaxQuant score",156.9600000,1.0000000,,,,7.776519771012E-13,
LVADANTESESEDSER,ph,S,312,true,"Tissue atlas Arabidopsis - ProteomicsDB",114,32188942,"MaxQuant score",247.7000000,0.9905160,,,,0,
SLHSDESADGSGDGSPK,ph,S,343,true,"Tissue atlas Arabidopsis - ProteomicsDB",114,32188942,"MaxQuant score",244.4100000,0.9992430,,,,0,
HSPNHPAGQSDIIPSTEMLQK,ph,S,347,true,"Phospho cell culture sucrose/TOR",109,30833711,,,0.9650140,,,,,
HSPNHPAGQSDIIPSTEMLQK,ph,S,347,true,"Tissue atlas Arabidopsis - ProteomicsDB",114,32188942,"MaxQuant score",244.4100000,1.0000000,,,,0,
SNDSTEVGSSATASK,ph,S,592,true,"Tissue atlas Arabidopsis - ProteomicsDB",114,32188942,"MaxQuant score",142.6200000,0.9998870,,,,2.3139000049355E-8,
AAKEELNDSEEEEDDSEILDR,ph,S,661,true,"Large-scale phosphorylation discovery",44,23111157,XCorr,5.5610000,,,,,,
AAKEELNDSEEEEDDSEILDR,ph,S,661,true,"Col-0 callus - FC Col-0 vs. Col-0 Xray",111a,31410901,,55.4600000,,0.7221972,0.0000000,NO,,-0.0080263
AAKEELNDSEEEEDDSEILDR,ph,S,661,true,"Col-0 X-ray callus - FC Col-0 vs. Col-0 Xray",111b,31410901,,55.4600000,,0.7221972,0.0000000,NO,,-0.0080263
AAKEELNDSEEEEDDSEILDR,ph,S,661,true,"atm callus - FC atm vs. atm Xray",111c,31410901,,55.4600000,,-0.1466598,0.0000000,NO,,-0.0080263
AAKEELNDSEEEEDDSEILDR,ph,S,661,true,"atm-3 X-ray callus - FC atm vs. atm Xray",111d,31410901,,55.4600000,,-0.1466598,0.0000000,NO,,-0.0080263
EELNDSEEEEDDSEILDRK,ph,S,661,true,"srk2dei ABA signaling phopshoproteomics",83,23572148,"MASCOT Score",42.0000000,,,,,,-0.0011000
EELNDSEEEEDDSEILDRK,ph,S,661,true,"TOR Kinase and ABA Receptor",100,29290610,XCorr,4.8156714,1.0000000,,,,1.1060000360885E-5,
EELNDSEEEEDDSEILDR,ph,S,661,true,"LAXIC - mannitol vs control",84b,23660473,XCorr,5.1900000,1.0000000,,,,5.1000000667045E-7,
EELNDSEEEEDDSEILDR,ph,S,661,true,"Phospho cell culture sucrose/TOR",109,30833711,,,1.0000000,,,,,
EELNDSEEEEDDSEILDR,ph,S,661,true,"Tissue atlas Arabidopsis - ProteomicsDB",114,32188942,"MaxQuant score",391.6400000,1.0000000,,,,0,
