Peptide,PTM,ModifiedAA,ModifiedPosition,PeptideUniqueToGene,ExperimentDesc,ExpID,PubmedID,ScoreType,IdentScore,LocProb,Log2FChange,PQ-val,QuantSig,PEP,MassErrorPPM
SRISGDGGSRVSIPADLLQTIQN,nta,S,2,true,"HUNTER N-terminome: legumain, GluC and trypsin",119,31951383,"MaxQuant score",71.5350000,,,,,,
KKENLVPNTQGR,ub,K,72,true,"Arabidopsis ubiquitination COFRADIC",40,26744219,"MaxQuant Score",92.0390000,0.8170000,,,,4.9170001148013E-5,0.2120000
NDTKPSSIMAPNPISLPSGISNQK,ph,S,151,true,"Tissue atlas Arabidopsis - ProteomicsDB",114,32188942,"MaxQuant score",127.8600000,0.9854250,,,,1.0176699530025E-27,
IQDAIISPVDKVDTEEQPLSK,ph,S,161,true,"SnRK2 protein kinase substrates",85,23776212,XCorr,3.0356102,1.0000000,,,,5.0844398913341E-8,
IQDAIISPVDKVDTEEQPLSK,ph,S,161,true,"Protein sumoylation and phosphorylation cross-talk",97,28419593,,,,,,,,
IQDAIISPVDKVDTEEQPLSK,ph,S,161,true,"Col-0 callus - FC Col-0 vs. Col-0 Xray",111a,31410901,,67.1800000,,1.4260272,0.0000000,NO,,0.8353616
IQDAIISPVDKVDTEEQPLSK,ph,S,161,true,"Col-0 X-ray callus - FC Col-0 vs. Col-0 Xray",111b,31410901,,67.1800000,,1.4260272,0.0000000,NO,,0.8353616
IQDAIISPVDKVDTEEQPLSK,ph,S,161,true,"atm callus - FC atm vs. atm Xray",111c,31410901,,67.1800000,,3.4056238,0.0000000,NO,,0.8353616
IQDAIISPVDKVDTEEQPLSK,ph,S,161,true,"atm-3 X-ray callus - FC atm vs. atm Xray",111d,31410901,,67.1800000,,3.4056238,0.0000000,NO,,0.8353616
IQDAIISPVDK,ph,S,161,true,"Arabidopsis root NAA phosphoproteome",18a,27643528,"MaxQuant Score",65.3740000,1.0000000,,,,4.1610001062509E-5,-0.3280000
IQDAIISPVDK,ph,S,161,true,"STN8 phosphoproteome",38,21768351,"MASCOT Score",48.5300000,,,,,,-0.2284880
IQDAIISPVDK,ph,S,161,true,"srk2dei ABA signaling phopshoproteomics",83,23572148,"MASCOT Score",24.0000000,,,,,,0.0007000
IQDAIISPVDK,ph,S,161,true,"TOR Kinase and ABA Receptor",100,29290610,XCorr,3.6802864,1.0000000,,,,0.0010870000114664,
IQDAIISPVDK,ph,S,161,true,"Tissue atlas Arabidopsis - ProteomicsDB",114,32188942,"MaxQuant score",234.8000000,1.0000000,,,,0,
EASSDKFTIGCDDSNIESSHGTAASAR,ph,S,280,true,"Tissue atlas Arabidopsis - ProteomicsDB",114,32188942,"MaxQuant score",121.8800000,0.8238730,,,,8.0265302709164E-35,
CDAPPISYPDQYSLAAAQQAMHLYR,og,S,368,true,"O-GlcNac Inflorescence Tissue",81,28154133,"MASCOT Score",30.9000000,,,,,,2.0000000
