Peptide,PTM,ModifiedAA,ModifiedPosition,PeptideUniqueToGene,ExperimentDesc,ExpID,PubmedID,ScoreType,IdentScore,LocProb,Log2FChange,PQ-val,QuantSig,PEP,MassErrorPPM
ACQAEWFR,ox,C,62,true,"Redox kickstart of mitochondria",112,31871212,,,,-1.5454604,0.0005963,YES,,
ACQAEWFRK,so,C,62,true,"S-sulfenylation site detection using YAP1C",110,32714340,,,,,,,,
TALSFNALLNACVNSK,ox,C,151,true,"Redox kickstart of mitochondria",112,31871212,,,,-1.3308312,0.0002496,YES,,
FVFNSLLPAICK,ox,C,328,true,"Redox kickstart of mitochondria",112,31871212,,,,-1.5685145,0.0000373,YES,,
AGDLESAYELCK,ox,C,340,true,"Redox kickstart of mitochondria",112,31871212,,,,-1.8435778,0.0000696,YES,,
AGDLESAYELCK,sno,C,340,true,"hot5-4 / wildtype, FAT-switch S-nitrosoproteome",169,37277371,,,,0.6767405,0.0082628,YES,,
AGDLESAYELCK,so,C,340,true,"Arabidopsis S-sulfenylation chemoproteomics",108,31578252,"pFind PSM Score",0.0044554,,2.3809500,,,,-1.4105420
TNDYLQCK,ox,C,386,true,"OxiTRAQ Arabidopsis - 5 mM H2O2 versus control",47,24376095,,,,1.3159005,0.0005404,YES,,
TNDYLQCK,ox,C,386,true,"Redox kickstart of mitochondria",112,31871212,,,,-1.5087458,0.0067183,YES,,
TNDYLQCK,sno,C,386,true,"hot5-4 / wildtype, FAT-switch S-nitrosoproteome",169,37277371,,,,,,,,
TNDYLQCK,so,C,386,true,"S-sulfenylation site detection using YAP1C",110,32714340,,,,,,,,
