Peptide,PTM,ModifiedAA,ModifiedPosition,PeptideUniqueToGene,ExperimentDesc,ExpID,PubmedID,ScoreType,IdentScore,LocProb,Log2FChange,PQ-val,QuantSig,PEP,MassErrorPPM
LGQACSSSLSPVHNFLNVQPEHR,ph,S,33,true,"Tissue atlas Arabidopsis - ProteomicsDB",114,32188942,"MaxQuant score",265.7500000,0.9999990,,,,0,
SQSPDSPGQLWPK,ph,S,55,true,"atm and atr DNA damage response",88,25561503,"MASCOT Score",32.0000000,0.9950000,,,,,0.7600000
SQSPDSPGQLWPK,ph,S,55,true,"Tissue atlas Arabidopsis - ProteomicsDB",114,32188942,"MaxQuant score",190.1000000,0.9999360,,,,3.3240798523739E-30,
SQSPDSPGQLWPK,ph,S,58,true,"atm and atr DNA damage response",88,25561503,"MASCOT Score",32.0000000,1.0000000,,,,,0.7600000
SQSPDSPGQLWPK,ph,S,58,true,"Tissue atlas Arabidopsis - ProteomicsDB",114,32188942,"MaxQuant score",122.3300000,1.0000000,,,,0.00031652400502935,
SPSIFTEDLGNQCDGGNSGSLLK,ph,S,121,true,"Tissue atlas Arabidopsis - ProteomicsDB",114,32188942,"MaxQuant score",291.2800000,0.9134980,,,,0,
AETPRLDEIYETPLASNPVTR,ph,T,193,true,"Large-scale phosphorylation discovery",44,23111157,XCorr,5.4370000,,,,,,
AETPRLDEIYETPLASNPVTR,ph,T,193,true,"Tissue atlas Arabidopsis - ProteomicsDB",114,32188942,"MaxQuant score",112.3600000,1.0000000,,,,6.829419842147E-12,
AETPRLDEIYETPLASNPVTR,ph,Y,200,true,"Large-scale phosphorylation discovery",44,23111157,XCorr,4.7080000,,,,,,
LSPSQSCVPGAMSVDVVSSHPSPGSAANQK,ph,S,213,true,"Tissue atlas Arabidopsis - ProteomicsDB",114,32188942,"MaxQuant score",79.1120000,0.9667820,,,,2.6018499854619E-11,
ASSPQPPLPAENK,ph,S,410,true,"atm and atr DNA damage response",88,25561503,"MASCOT Score",35.0000000,0.9970000,,,,,-0.4700000
ASSPQPPLPAENK,ph,S,410,true,"Col-0 callus - FC Col-0 vs. Col-0 Xray",111a,31410901,,35.6100000,,-0.6180527,0.0000000,NO,,0.4416864
ASSPQPPLPAENK,ph,S,410,true,"Col-0 X-ray callus - FC Col-0 vs. Col-0 Xray",111b,31410901,,35.6100000,,-0.6180527,0.0000000,NO,,0.4416864
ASSPQPPLPAENK,ph,S,410,true,"atm callus - FC atm vs. atm Xray",111c,31410901,,35.6100000,,-0.8401183,0.0000000,NO,,0.4416864
ASSPQPPLPAENK,ph,S,410,true,"atm-3 X-ray callus - FC atm vs. atm Xray",111d,31410901,,35.6100000,,-0.8401183,0.0000000,NO,,0.4416864
ASSPQPPLPAENK,ph,S,410,true,"Tissue atlas Arabidopsis - ProteomicsDB",114,32188942,"MaxQuant score",160.4600000,0.9900430,,,,3.8140099412054E-10,
ASETEDDKCESPQKR,ph,S,431,true,"Tissue atlas Arabidopsis - ProteomicsDB",114,32188942,"MaxQuant score",144.1700000,1.0000000,,,,6.7161098904478E-9,
