Peptide,PTM,ModifiedAA,ModifiedPosition,PeptideUniqueToGene,ExperimentDesc,ExpID,PubmedID,ScoreType,IdentScore,LocProb,Log2FChange,PQ-val,QuantSig,PEP,MassErrorPPM
RVDTSFGSQSGLQNNPLLKPHLR,ph,S,369,true,"Tissue atlas Arabidopsis - ProteomicsDB",114,32188942,"MaxQuant score",45.1930000,0.8517760,,,,0.0011649499647319,
TSSERDSEAPFVVDDLQPSPK,ph,S,745,true,"TOR Kinase and ABA Receptor",100,29290610,XCorr,3.3065107,1.0000000,,,,0.0014669999945909,
DSEAPFVVDDLQPSPKR,ph,S,745,true,"Tissue atlas Arabidopsis - ProteomicsDB",114,32188942,"MaxQuant score",286.6900000,1.0000000,,,,0,
DSEAPFVVDDLQPSPK,ph,S,745,true,"STN8 phosphoproteome",38,21768351,"MASCOT Score",55.7500000,,,,,,-1.7209300
DSEAPFVVDDLQPSPK,ph,S,745,true,"Tyrosine phosphorylation in Arabidopsis",59,18463617,"MASCOT Score",33.0000000,,,,,,-2.4687321
DSEAPFVVDDLQPSPK,ph,S,745,true,"atm and atr DNA damage response",88,25561503,"MASCOT Score",49.0000000,1.0000000,,,,,-1.5800000
DSEAPFVVDDLQPSPK,ph,S,745,true,"TOR Kinase and ABA Receptor",100,29290610,XCorr,3.5409067,1.0000000,,,,0.0005578999989666,
DRLPSDVCKPVR,ac,K,794,true,"Histone deacetylases - apicidin vs control",98a,29061669,"MaxQuant Score",55.3000000,1.0000000,0.3440000,0.2409905,NO,0.0049999998882413,
ELEKPVCKDTHMGR,ac,K,822,true,"Histone deacetylases substrates - hda14 vs WT",98e,29061669,"MaxQuant Score",96.9000000,1.0000000,0.0740000,0.9204496,NO,0.0020000000949949,
ELEKPVCK,ac,K,822,true,"Histone deacetylases - apicidin vs control",98a,29061669,"MaxQuant Score",113.7000000,1.0000000,-0.7290000,0.0051050,YES,0.0040000001899898,
ELEKPVCKDTHMGR,ac,K,826,true,"Histone deacetylases substrates - hda14 vs WT",98e,29061669,"MaxQuant Score",96.9000000,1.0000000,0.0740000,0.9204496,NO,0.0020000000949949,
HGVKSALDGESLR,ac,K,836,true,"Quantitative Acetylproteomics",101,29440448,,,,,,,,
KLMPKKVISKR,ac,K,1330,true,"Histone deacetylases - apicidin vs control",98a,29061669,"MaxQuant Score",96.7000000,1.0000000,4.6800000,0.0060674,YES,0.0010000000474975,
KLMPKKVISKR,ac,K,1330,true,"Quantitative Acetylproteomics",101,29440448,,,,,,,,
KLMPKKVISK,ac,K,1330,true,"Quantitative Acetylproteomics",101,29440448,,,,,,,,
KLMPKKVISKR,ac,K,1334,true,"Histone deacetylases - apicidin vs control",98a,29061669,"MaxQuant Score",96.7000000,1.0000000,4.6800000,0.0060674,YES,0.0010000000474975,
KLMPKKVISKR,ac,K,1334,true,"Quantitative Acetylproteomics",101,29440448,,,,,,,,
LMPKKVISKR,ac,K,1334,true,"Quantitative Acetylproteomics",101,29440448,,,,,,,,
KLMPKKVISK,ac,K,1334,true,"Quantitative Acetylproteomics",101,29440448,,,,,,,,
KLMPKKVISKR,ac,K,1335,true,"Histone deacetylases - apicidin vs control",98a,29061669,"MaxQuant Score",96.7000000,1.0000000,4.6800000,0.0060674,YES,0.0010000000474975,
KLMPKKVISKR,ac,K,1335,true,"Quantitative Acetylproteomics",101,29440448,,,,,,,,
LMPKKVISKR,ac,K,1335,true,"Quantitative Acetylproteomics",101,29440448,,,,,,,,
KLMPKKVISK,ac,K,1335,true,"Quantitative Acetylproteomics",101,29440448,,,,,,,,
KLMPKKVISKR,ac,K,1339,true,"Histone deacetylases - apicidin vs control",98a,29061669,"MaxQuant Score",96.7000000,1.0000000,4.6800000,0.0060674,YES,0.0010000000474975,
KLMPKKVISKR,ac,K,1339,true,"Quantitative Acetylproteomics",101,29440448,,,,,,,,
LMPKKVISKR,ac,K,1339,true,"Quantitative Acetylproteomics",101,29440448,,,,,,,,
