Peptide,PTM,ModifiedAA,ModifiedPosition,PeptideUniqueToGene,ExperimentDesc,ExpID,PubmedID,ScoreType,IdentScore,LocProb,Log2FChange,PQ-val,QuantSig,PEP,MassErrorPPM
ALVGGVGDVPANQNSGEVESLAR,nt,A,2,true,"Stromal N-terminome",96,26371235,"MASCOT Score",67.9100000,,,,,,
ALVGGVGDVPANQNSGEVESLAR,nt,A,2,true,"Arg/N-end rule seed, prt6 vs. Wt",99,29168982,"MASCOT Score",111.1100000,,,,,8.7350002786479E-7,0.5926176
ALVGGVGDVPANQNSGEVE,nt,A,2,true,"Arg/N-end rule seed, prt6 vs. Wt",99,29168982,"MASCOT Score",27.5600000,,,,,0.0095889996737242,-3.9094256
ALVGGVGDVPANQNSGE,nt,A,2,true,"Arg/N-end rule seed, prt6 vs. Wt",99,29168982,"MASCOT Score",61.3500000,,0.9416199,0.3086875,NO,2.484999868102E-7,0.2330195
ALVGGVGDVP,nt,A,2,true,"N-term acetylation drought responses",5,26184543,,,,,,,,
ALVGGVGDVPANQNSGEVESLARF,nta,A,2,true,"Arabidopsis translation initiation landscape - NTA",167a,35069635,,,,,,,,
ALVGGVGDVPANQNSGEVESLAR,nta,A,2,true,"Characterization plant N-terminal acetylation",6,22223895,"MASCOT Score",97.5100000,,,,,,
ALVGGVGDVPANQNSGEVESLAR,nta,A,2,true,"Arg/N-end rule pathway Roots",80,25728785,"MASCOT Score",90.8000000,,,,,3.6800000202675E-7,
ALVGGVGDVPANQNSGEVESLAR,nta,A,2,true,"Stromal N-terminome",96,26371235,"MASCOT Score",67.9100000,,,,,,
ALVGGVGDVPANQNSGEVESLAR,nta,A,2,true,"Arg/N-end rule seed, prt6 vs. Wt",99,29168982,"MASCOT Score",111.1100000,,,,,8.7350002786479E-7,0.5926176
ALVGGVGDVPANQNSGEVESLAR,nta,A,2,true,"HUNTER N-terminome: legumain, GluC and trypsin",119,31951383,"MaxQuant score",257.5000000,,,,,,
ALVGGVGDVPANQNSGEVE,nta,A,2,true,"Arg/N-end rule seed, prt6 vs. Wt",99,29168982,"MASCOT Score",27.5600000,,,,,0.0095889996737242,-3.9094256
ALVGGVGDVPANQNSGEVE,nta,A,2,true,"HUNTER N-terminome: legumain, GluC and trypsin",119,31951383,"MaxQuant score",86.8030000,,,,,,
ALVGGVGDVPANQNSGE,nta,A,2,true,"Arg/N-end rule seed, prt6 vs. Wt",99,29168982,"MASCOT Score",61.3500000,,,,,2.484999868102E-7,0.2330195
ALVGGVGDVPAN,nta,A,2,true,"HUNTER N-terminome: legumain, GluC and trypsin",119,31951383,"MaxQuant score",145.8900000,,,,,,
ALVGGVGDVP,nta,A,2,true,"N-term acetylation drought responses",5,26184543,,,,,,,,
GVGDVPANQNSGEVESLAR,nt,G,6,true,"Arg/N-end rule seed, prt6 vs. Wt",99,29168982,"MASCOT Score",75.5300000,,-0.4475670,0.0850176,NO,0.00054679997265339,-1.0645719
GVGDVPANQNSGE,nt,G,6,true,"Arg/N-end rule seed, prt6 vs. Wt",99,29168982,"MASCOT Score",56.6700000,,-0.1691705,0.1724822,NO,9.6930001802775E-8,-0.4906681
DVPANQNSGEVESLAR,nt,D,9,true,"Arg/N-end rule seed, prt6 vs. Wt",99,29168982,"MASCOT Score",58.0000000,,-1.8362715,0.0075612,YES,0.0055490001104772,-0.9751637
AKEQVVAGTLHHLTLEILEAGQK,ub,K,47,true,"upl3 mutant / wildtype",168,35926874,"MaxQuant score",73.8310000,1.0000000,0.6825733,,,1.5536400042038E-6,0.8434100
QVVAGTLHHLTLE,nt,Q,49,true,"HUNTER N-terminome: legumain, GluC and trypsin",119,31951383,"MaxQuant score",117.9900000,,,,,,
VWVKPWLNFK,ub,K,78,true,"upl3 mutant / wildtype",168,35926874,"MaxQuant score",53.7560000,1.0000000,0.2314324,0.4722800,NO,0.0044721900485456,0.0141190
ELQEFKPASDAPAITSSDLGCK,ph,T,99,true,"Tissue atlas Arabidopsis - ProteomicsDB",114,32188942,"MaxQuant score",177.8500000,0.7968290,,,,0,
ELQEFKPASDAPAITSSDLGCK,ph,S,100,true,"Tissue atlas Arabidopsis - ProteomicsDB",114,32188942,"MaxQuant score",340.4900000,0.9295280,,,,0,
ELQEFKPASDAPAITSSDLGCK,ph,S,101,true,"srk2dei ABA signaling phopshoproteomics",83,23572148,"MASCOT Score",50.0000000,,,,,,-0.0018000
ELQEFKPASDAPAITSSDLGCK,ph,S,101,true,"Tissue atlas Arabidopsis - ProteomicsDB",114,32188942,"MaxQuant score",312.6400000,0.9664670,,,,0,
ELQEFKPASDAPAITSSDLGCK,acy,C,105,true,"Arabidopsis S-acylation atlas - Silique",163e,35681017,,,,,,,,
ELQEFKPASDAPAITSSDLGCK,ox,C,105,true,"SPEAR - 50 mM H2O2 / mock",138b,34619326,,,,1.0447531,0.0177760,YES,,
ELQEFKPASDAPAITSSDLGCK,sno,C,105,true,"Site-specific nitrosomeproteomic id - gsnor1-3",90a,25699590,XCorr,5.3641911,,,,,9.1551398406775E-11,-5.4450098
ELQEFKPASDAPAITSSDLGCK,sno,C,105,true,"Site-specific nitrosomeproteomic id - gsnor1-3",90b,25699590,XCorr,5.1600000,,,,,5.4480001381307E-6,-5.7100000
ELQEFKPASDAPAITSSDLGCK,sno,C,105,true,"hot5-4 / wildtype, FAT-switch S-nitrosoproteome",169,37277371,,,,1.4428243,0.0171968,YES,,
ELQEFKPASDAPAITSSDLGCK,so,C,105,true,"Arabidopsis S-sulfenylation chemoproteomics",108,31578252,"pFind PSM Score",0.0000019,,3.3370400,,,,-0.8810214
ELQEFKPASDAPAITSSDLGCK,so,C,105,true,"S-sulfenylation site detection using YAP1C",110,32714340,,,,,,,,
ELQEFKPASDAPAITSSDLGCKQGEHESGWR,ub,K,106,true,"upl3 mutant / wildtype",168,35926874,"MaxQuant score",131.9500000,1.0000000,-0.7249930,,,2.6260598866929E-28,1.0455000
SGWREVPGDDPE,nt,S,112,true,"N-terminal ChaFRADIC",92,26010716,"MASCOT Score",26.5000000,,,,,0.0027179999742657,
EVPGDDPEVKHVAEQAVKTIQQR,ub,K,125,true,"Arabidopsis ubiquitination COFRADIC",40,26744219,"MaxQuant Score",93.5830000,1.0000000,,,,8.1639998295661E-37,-0.0110000
HVAEQAVKTIQQR,ac,K,133,true,"Quantitative Acetylproteomics",101,29440448,,,,,,,,
HVAEQAVKTIQQR,ub,K,133,true,"upl3 mutant / wildtype",168,35926874,"MaxQuant score",117.2000000,1.0000000,-0.5311561,,,9.702119996291E-7,-0.0110410
