Peptide,PTM,ModifiedAA,ModifiedPosition,PeptideUniqueToGene,ExperimentDesc,ExpID,PubmedID,ScoreType,IdentScore,LocProb,Log2FChange,PQ-val,QuantSig,PEP,MassErrorPPM
VPDYGHSQGQGHGDVTMDDR,ph,S,93,true,"atm and atr DNA damage response",88,25561503,"MASCOT Score",54.0000000,1.0000000,,,,,-1.2000000
RKPISDEVNDSDEEYKK,ph,S,122,true,"STN8 phosphoproteome",38,21768351,"MASCOT Score",92.5300000,,,,,,-2.0477900
RKPISDEVNDSDEEYKK,ph,S,122,true,"Phosphoproteome ethylene-regulated time response",46,24043427,"MASCOT Score",67.7800000,,,,,,5.0782000
RKPISDEVNDSDEEYKK,ph,S,122,true,"PAMP-triggered phosphorylation",48,24601666,"MASCOT Score",27.2300000,,,,,,
RKPISDEVNDSDEEYKK,ph,S,122,true,"Tyrosine phosphorylation in Arabidopsis",59,18463617,"MASCOT Score",74.0000000,,,,,,-0.7977680
RKPISDEVNDSDEEYKK,ph,S,122,true,"Chloroplast kinase substrates",60,19376835,"MASCOT Score",81.0600000,,,,,,2.3824900
RKPISDEVNDSDEEYKK,ph,S,122,true,"srk2dei ABA signaling phopshoproteomics",83,23572148,"MASCOT Score",54.0000000,,,,,,0.0009000
RKPISDEVNDSDEEYKK,ph,S,122,true,"LAXIC - mannitol vs control",84b,23660473,XCorr,4.6500000,0.9430000,,,,8.5000001490698E-6,
RKPISDEVNDSDEEYKK,ph,S,122,true,"SnRK2 protein kinase substrates",85,23776212,XCorr,4.8614235,0.9980000,,,,6.0939600032839E-9,
RKPISDEVNDSDEEYKK,ph,S,122,true,"Touch-induced phosphorylation: 40s touch vs untouc",136,30291188,"MASCOT score",51.7500000,,-0.0329070,0.8329989,NO,,-0.4965465
RKPISDEVNDSDEEYK,ph,S,122,true,"Arabidopsis root NAA phosphoproteome",18a,27643528,"MaxQuant Score",72.3590000,0.9930000,,,,1.4050000629595E-7,-1.6390000
RKPISDEVNDSDEEYK,ph,S,122,true,"Tyrosine phosphorylation in Arabidopsis",59,18463617,"MASCOT Score",50.0000000,,,,,,-1.3480795
RKPISDEVNDSDEEYK,ph,S,122,true,"srk2dei ABA signaling phopshoproteomics",83,23572148,"MASCOT Score",51.0000000,,,,,,0.0015000
RKPISDEVNDSDEEYK,ph,S,122,true,"TOR Kinase and ABA Receptor",100,29290610,XCorr,4.1877503,0.9996000,,,,0.0002614000113681,
RKPISDEVNDSDEEYK,ph,S,122,true,"Phospho cell culture sucrose/TOR",109,30833711,,,1.0000000,,,,,
KPISDEVNDSDEEYKK,ph,S,122,true,"STN8 phosphoproteome",38,21768351,"MASCOT Score",70.9500000,,,,,,-0.9105330
KPISDEVNDSDEEYKK,ph,S,122,true,"Phosphoproteome ethylene-regulated time response",46,24043427,"MASCOT Score",77.5400000,,,,,,-4.3648000
KPISDEVNDSDEEYKK,ph,S,122,true,"Tyrosine phosphorylation in Arabidopsis",59,18463617,"MASCOT Score",58.0000000,,,,,,-0.9114644
KPISDEVNDSDEEYKK,ph,S,122,true,"srk2dei ABA signaling phopshoproteomics",83,23572148,"MASCOT Score",51.0000000,,,,,,0.0009000
KPISDEVNDSDEEYKK,ph,S,122,true,"LAXIC - mannitol vs control",84b,23660473,XCorr,2.7600000,0.9910000,,,,0.0012235300382599,
KPISDEVNDSDEEYKK,ph,S,122,true,"atm and atr DNA damage response",88,25561503,"MASCOT Score",24.0000000,1.0000000,,,,,-2.8400000
KPISDEVNDSDEEYKK,ph,S,122,true,"Tissue atlas Arabidopsis - ProteomicsDB",114,32188942,"MaxQuant score",332.9600000,1.0000000,,,,0,
KPISDEVNDSDEEYK,ph,S,122,true,"Large-scale phosphorylation discovery",44,23111157,XCorr,6.0600000,,,,,,
KPISDEVNDSDEEYK,ph,S,122,true,"Tyrosine phosphorylation in Arabidopsis",59,18463617,"MASCOT Score",37.0000000,,,,,,-0.9746858
KPISDEVNDSDEEYK,ph,S,122,true,"Chloroplast kinase substrates",60,19376835,"MASCOT Score",44.2300000,,,,,,-1.6445500
KPISDEVNDSDEEYK,ph,S,122,true,"atm and atr DNA damage response",88,25561503,"MASCOT Score",71.0000000,1.0000000,,,,,-0.6800000
KPISDEVNDSDEEYK,ph,S,122,true,"Lateral root-induction - NAA vs control",106,23328941,"MASCOT Score",36.0000000,,,,,,
KPISDEVNDSDEEYK,ph,S,122,true,"Col-0 callus - FC Col-0 vs. Col-0 Xray",111a,31410901,,68.2800000,,-0.3500274,0.0000000,NO,,1.1089575
KPISDEVNDSDEEYK,ph,S,122,true,"Col-0 X-ray callus - FC Col-0 vs. Col-0 Xray",111b,31410901,,68.2800000,,-0.3500274,0.0000000,NO,,1.1089575
KPISDEVNDSDEEYK,ph,S,122,true,"atm callus - FC atm vs. atm Xray",111c,31410901,,68.2800000,,-0.6781117,0.0000000,NO,,1.1089575
KPISDEVNDSDEEYK,ph,S,122,true,"atm-3 X-ray callus - FC atm vs. atm Xray",111d,31410901,,68.2800000,,-0.6781117,0.0000000,NO,,1.1089575
EMEVEAANSGQPPPEDNVKMHASESSPQEDEKK,ph,S,177,true,"SnRK2 protein kinase substrates",85,23776212,XCorr,2.3716245,0.8000000,,,,0.11156699806452,
EMEVEAANSGQPPPEDNVK,ph,S,177,true,"atm and atr DNA damage response",88,25561503,"MASCOT Score",39.0000000,1.0000000,,,,,-0.8900000
EMEVEAANSGQPPPEDNVK,ph,S,177,true,"Tissue atlas Arabidopsis - ProteomicsDB",114,32188942,"MaxQuant score",129.4600000,1.0000000,,,,7.8873997041767E-15,
MHASESSPQEDEKK,ph,S,193,true,"Tissue atlas Arabidopsis - ProteomicsDB",114,32188942,"MaxQuant score",143.4200000,0.9862870,,,,2.2098476782402E-42,
MHASESSPQEDEK,ph,S,193,true,"Lateral root-induction - NAA vs control",106,23328941,"MASCOT Score",36.0000000,,,,,,
MHASESSPQEDEKK,ph,S,194,true,"atm and atr DNA damage response",88,25561503,"MASCOT Score",27.0000000,0.9920000,,,,,-0.9600000
MHASESSPQEDEKK,ph,S,194,true,"Tissue atlas Arabidopsis - ProteomicsDB",114,32188942,"MaxQuant score",272.1200000,0.9999220,,,,0,
MHASESSPQEDEK,ph,S,194,true,"Large-scale phosphorylation discovery",44,23111157,XCorr,4.4050000,,,,,,
MHASESSPQEDEK,ph,S,194,true,"SnRK2 protein kinase substrates",85,23776212,XCorr,3.5690808,0.9970000,,,,2.1098000502207E-7,
MHASESSPQEDEK,ph,S,194,true,"atm and atr DNA damage response",88,25561503,"MASCOT Score",59.0000000,0.9970000,,,,,1.1200000
MHASESSPQEDEK,ph,S,194,true,"TOR Kinase and ABA Receptor",100,29290610,XCorr,5.0475225,0.9998000,,,,2.7190000764676E-5,
MHASESSPQEDEK,ph,S,194,true,"Phospho cell culture sucrose/TOR",109,30833711,,,0.9931720,,,,,
KGIDGTAASNEDTK,ph,S,209,true,"Tissue atlas Arabidopsis - ProteomicsDB",114,32188942,"MaxQuant score",174.8700000,0.9999200,,,,3.0914799397629E-16,
GIDGTAASNEDTK,ph,S,209,true,"atm and atr DNA damage response",88,25561503,"MASCOT Score",54.0000000,1.0000000,,,,,0.4800000
QHLQSPKEGIDFDLNAESLDLNETK,ph,S,219,true,"SnRK2 protein kinase substrates",85,23776212,XCorr,3.5768402,1.0000000,,,,0.0097963400185108,
QHLQSPKEGIDFDLNAESLDLNETK,ph,S,219,true,"Phospho cell culture sucrose/TOR",109,30833711,,,1.0000000,,,,,
QHLQSPKEGIDFDLNAESLDLNETK,ph,S,219,true,"Tissue atlas Arabidopsis - ProteomicsDB",114,32188942,"MaxQuant score",286.2000000,1.0000000,,,,0,
KGIDGTAASNEDTKQHLQSPK,ph,S,219,true,"STN8 phosphoproteome",38,21768351,"MASCOT Score",56.8100000,,,,,,-2.6613200
KGIDGTAASNEDTKQHLQSPK,ph,S,219,true,"Chloroplast kinase substrates",60,19376835,"MASCOT Score",47.6300000,,,,,,-2.6613200
GIDGTAASNEDTKQHLQSPK,ph,S,219,true,"STN8 phosphoproteome",38,21768351,"MASCOT Score",55.4800000,,,,,,-0.8641180
LAPATGTTTTTTAATDSEEYSGWPMMDISK,og,T,244,true,"O-GlcNac Inflorescence Tissue",81,28154133,"MASCOT Score",29.8000000,,,,,,-0.6200000
MDPAQLASLGKR,ac,K,280,true,"Quantitative Acetylproteomics",101,29440448,,,,,,,,
