Peptide,PTM,ModifiedAA,ModifiedPosition,PeptideUniqueToGene,ExperimentDesc,ExpID,PubmedID,ScoreType,IdentScore,LocProb,Log2FChange,PQ-val,QuantSig,PEP,MassErrorPPM
TDVSTDGDTDHR,ph,S,11,true,"atm and atr DNA damage response",88,25561503,"MASCOT Score",35.0000000,1.0000000,,,,,-0.1400000
TDVSTDGDTDHR,ph,S,11,true,"Tissue atlas Arabidopsis - ProteomicsDB",114,32188942,"MaxQuant score",124.4800000,0.9999840,,,,2.7692499404708E-9,
TDVSTDGDTDHR,ph,T,12,true,"atm and atr DNA damage response",88,25561503,"MASCOT Score",35.0000000,1.0000000,,,,,-0.1400000
TDVSTDGDTDHR,ph,T,12,true,"Tissue atlas Arabidopsis - ProteomicsDB",114,32188942,"MaxQuant score",108.3700000,0.9999660,,,,2.7692499404708E-9,
DLGSDRGHMHAAASDSSDR,ph,S,23,true,"Tissue atlas Arabidopsis - ProteomicsDB",114,32188942,"MaxQuant score",40.9370000,0.9922090,,,,0.0054672998376191,
GHMHAAASDSSDRSK,ph,S,33,true,"atm and atr DNA damage response",88,25561503,"MASCOT Score",38.0000000,1.0000000,,,,,-0.0900000
GHMHAAASDSSDRSK,ph,S,35,true,"atm and atr DNA damage response",88,25561503,"MASCOT Score",38.0000000,1.0000000,,,,,-0.0900000
GHMHAAASDSSDRSK,ph,S,36,true,"atm and atr DNA damage response",88,25561503,"MASCOT Score",38.0000000,1.0000000,,,,,-0.0900000
