Peptide,PTM,ModifiedAA,ModifiedPosition,PeptideUniqueToGene,ExperimentDesc,ExpID,PubmedID,ScoreType,IdentScore,LocProb,Log2FChange,PQ-val,QuantSig,PEP,MassErrorPPM
MEANDCQEEHKFTLDNYHVVEQVR,nta,M,3,true,"Arabidopsis translation initiation landscape - NTA",167a,35069635,,,,,,,,
RNSLPGK,ph,S,307,true,"Tissue atlas Arabidopsis - ProteomicsDB",114,32188942,"MaxQuant score",82.2610000,1.0000000,,,,0.016513699665666,
ETENIFSEESQLR,ph,S,413,true,"Tissue atlas Arabidopsis - ProteomicsDB",114,32188942,"MaxQuant score",203.8500000,0.9998830,,,,9.9805002823253E-39,
DVDVGVVSAQEVACSPPR,ph,S,434,true,"STN8 phosphoproteome",38,21768351,"MASCOT Score",77.3200000,,,,,,
DVDVGVVSAQEVACSPPR,ph,S,434,true,"SnRK2 protein kinase substrates",85,23776212,XCorr,3.0434172,1.0000000,,,,2.7430800686457E-11,
DVDVGVVSAQEVACSPPR,ph,S,434,true,"Tissue atlas Arabidopsis - ProteomicsDB",114,32188942,"MaxQuant score",287.7500000,1.0000000,,,,0,
DHLSGSLEGDKAK,ph,S,479,true,"Tissue atlas Arabidopsis - ProteomicsDB",114,32188942,"MaxQuant score",112.0200000,0.9931960,,,,3.2320498576155E-5,
ADALECLLEK,sno,C,519,true,"hot5-4 / wildtype, FAT-switch S-nitrosoproteome",169,37277371,,,,,,,,
ADALECLLEK,so,C,519,true,"S-sulfenylation site detection using YAP1C",110,32714340,,,,,,,,
