Peptide,PTM,ModifiedAA,ModifiedPosition,PeptideUniqueToGene,ExperimentDesc,ExpID,PubmedID,ScoreType,IdentScore,LocProb,Log2FChange,PQ-val,QuantSig,PEP,MassErrorPPM
TMMTPPPLDQQE,nt,T,2,true,"Arg/N-end rule seed, prt6 vs. Wt",99,29168982,"MASCOT Score",35.5200000,,-0.2114345,0.3188799,NO,6.8269997427706E-5,-5.4626885
TQHQFNARE,nt,T,137,false,"Arabidopsis translation initiation landscape - NT",167b,35069635,,,,,,,,
KVLDYWSYDSK,ub,K,182,false,"upl3 mutant / wildtype",168,35926874,"MaxQuant score",78.9640000,1.0000000,3.9487877,0.0114640,YES,0.0055881999433041,-0.0709870
KETGFVGLK,ub,K,193,false,"upl3 mutant / wildtype",168,35926874,"MaxQuant score",89.8270000,1.0000000,0.7441611,0.3945800,NO,0.0065601500682533,-0.0853860
ELTKSFGWDTYDSFMQHDVQELNR,ub,K,266,false,"upl3 mutant / wildtype",168,35926874,"MaxQuant score",96.1280000,1.0000000,1.9844071,,,3.6622099797157E-10,0.2603300
VLCEKLEDK,ub,K,291,false,"upl3 mutant / wildtype",168,35926874,"MaxQuant score",105.9800000,1.0000000,-0.0144996,0.9838200,NO,0.00257009989582,-0.6570500
MKGTVVEGTIQK,ub,K,297,true,"upl3 mutant / wildtype",168,35926874,"MaxQuant score",67.2340000,1.0000000,1.1276333,0.3516400,NO,0.0028880198951811,-0.5457300
KESFYDLQLDVK,ph,S,331,false,"Tissue atlas Arabidopsis - ProteomicsDB",114,32188942,"MaxQuant score",204.1300000,1.0000000,,,,7.4818701393115E-31,
KESFYDLQLDVKGCK,ub,K,340,false,"upl3 mutant / wildtype",168,35926874,"MaxQuant score",146.3000000,1.0000000,0.9045804,0.0323410,YES,1.4347900038209E-12,-1.2986000
GCKDVYASFDK,ub,K,343,false,"upl3 mutant / wildtype",168,35926874,"MaxQuant score",81.9200000,1.0000000,1.8213020,0.0391180,YES,0.0014762399950996,-0.0603900
ALEEQYGGEEELPQNNPGFNNPPFKFTK,ub,K,507,true,"upl3 mutant / wildtype",168,35926874,"MaxQuant score",80.7330000,1.0000000,1.4910835,0.0573770,NO,7.9600097346866E-11,-0.3664900
FTKYSNAYMLVYIR,ub,K,510,false,"upl3 mutant / wildtype",168,35926874,"MaxQuant score",91.6200000,1.0000000,-0.1440103,0.7837800,NO,4.1972798499046E-5,-0.3681300
IICNVDEK,sno,C,530,false,"hot5-4 / wildtype, FAT-switch S-nitrosoproteome",169,37277371,,,,,,,,
IICNVDEKDIAEHLR,so,C,530,false,"S-sulfenylation site detection using YAP1C",110,32714340,,,,,,,,
IICNVDEK,so,C,530,false,"Arabidopsis S-sulfenylation chemoproteomics",108,31578252,"pFind PSM Score",0.1676440,,1.3342800,,,,0.4655196
QNHTYRPNRPLSPNEELQTVGQIR,nt,Q,632,true,"HUNTER N-terminome: legumain, GluC and trypsin",119,31951383,"MaxQuant score",129.3200000,,,,,,
QNHTYRPNRPLSPNEELQTVGQIR,nt,Q,632,true,"Arabidopsis translation initiation landscape - NT",167b,35069635,,,,,,,,
LTSHNCYSQQPKPQPIK,sno,C,852,false,"Site-specific nitrosomeproteomic id - gsnor1-3",90a,25699590,XCorr,3.3600000,,,,,0.1216000020504,-6.5500000
LTSHNCYSQQPKPQPIK,so,C,852,false,"S-sulfenylation site detection using YAP1C",110,32714340,,,,,,,,
LTSHNCYSQQPK,so,C,852,false,"Arabidopsis S-sulfenylation chemoproteomics",108,31578252,"pFind PSM Score",0.0922983,,1.4705900,,,,-1.1307235
AEEIPEEEKNIGPNDR,ub,K,987,false,"Arabidopsis ubiquitination COFRADIC",40,26744219,"MaxQuant Score",55.0110000,1.0000000,,,,8.5990002673952E-8,-0.1230000
HAYEKPVK,ac,K,1109,false,"Quantitative Acetylproteomics",101,29440448,,,,,,,,
HAYEKPVKIYN,ub,K,1112,false,"upl3 mutant / wildtype",168,35926874,"MaxQuant score",77.6740000,1.0000000,0.6888517,0.0564620,NO,0.00083100801566616,-0.3073500
