Peptide,PTM,ModifiedAA,ModifiedPosition,PeptideUniqueToGene,ExperimentDesc,ExpID,PubmedID,ScoreType,IdentScore,LocProb,Log2FChange,PQ-val,QuantSig,PEP,MassErrorPPM
ASMMQPQIILLKE,nt,A,2,true,"Arg/N-end rule seed, prt6 vs. Wt",99,29168982,"MASCOT Score",36.8200000,,,,,0.00059399998281151,-2.9942664
ASMMQPQIILLKEGTDTSQGKAQLVSNINACTAVGDVVR,nta,A,2,true,"Arg/N-end rule pathway Roots",80,25728785,"MASCOT Score",43.9500000,,,,,2.7620001219475E-7,
ASMMQPQIILLKEGTDTSQGKAQLVSNINACTAVGDVVR,nta,A,2,true,"HUNTER N-terminome: legumain, GluC and trypsin",119,31951383,"MaxQuant score",81.5950000,,,,,,
ASMMQPQIILLKEGTDTSQGKAQLVSN,nta,A,2,true,"HUNTER N-terminome: legumain, GluC and trypsin",119,31951383,"MaxQuant score",,,,,,,
ASMMQPQIILLKEGTD,nta,A,2,true,"HUNTER N-terminome: legumain, GluC and trypsin",119,31951383,"MaxQuant score",47.2880000,,,,,,
ASMMQPQIILLKEGT,nta,A,2,true,"Arabidopsis translation initiation landscape - NTA",167a,35069635,,,,,,,,
ASMMQPQIILLKE,nta,A,2,true,"Arg/N-end rule seed, prt6 vs. Wt",99,29168982,"MASCOT Score",36.8200000,,0.4420729,0.1651142,NO,0.00059399998281151,-2.9942664
ASMMQPQIILLKE,nta,A,2,true,"HUNTER N-terminome: legumain, GluC and trypsin",119,31951383,"MaxQuant score",74.6110000,,,,,,
ASMMQPQIILLK,nta,A,2,true,"Characterization plant N-terminal acetylation",6,22223895,"MASCOT Score",60.8400000,,,,,,
NINACTAVGDVVR,nt,N,28,true,"Metacaspase9 substrates - 35S:MC9 / mc9",51b,23964026,"MASCOT Score",45.0000000,,1.4899765,,NO,,-0.8209370
AQLVSNINACTAVGDVVR,sno,C,32,true,"hot5-4 / wildtype, FAT-switch S-nitrosoproteome",169,37277371,,,,0.0769579,0.5997526,NO,,
AQLVSNINACTAVGDVVR,so,C,32,true,"Arabidopsis S-sulfenylation chemoproteomics",108,31578252,"pFind PSM Score",0.0003480,,1.1840200,,,,0.5142152
AQLVSNINACTAVGDVVR,so,C,32,true,"S-sulfenylation site detection using YAP1C",110,32714340,,,,,,,,
TAVGDVVR,nt,T,33,true,"Arg/N-end rule seed, prt6 vs. Wt",99,29168982,"MASCOT Score",38.1000000,,-0.4825515,0.0046450,NO,0.047159999608994,0.1508168
CAATTLSSK,sno,C,161,true,"hot5-4 / wildtype, FAT-switch S-nitrosoproteome",169,37277371,,,,0.2924131,0.2153844,NO,,
TFSYAGFEQQPK,ph,S,224,true,"TOR Kinase and ABA Receptor",100,29290610,XCorr,2.9012849,0.9870000,,,,0.00041370000690222,
TFSYAGFEQQPK,ph,S,224,true,"Phospho cell culture sucrose/TOR",109,30833711,,,0.9997900,,,,,
TFSYAGFEQQPK,ph,S,224,true,"Tissue atlas Arabidopsis - ProteomicsDB",114,32188942,"MaxQuant score",178.4700000,0.9999390,,,,8.5220595628283E-22,
TFSYAGFEQQPK,ph,Y,225,true,"atm and atr DNA damage response",88,25561503,"MASCOT Score",33.0000000,0.9370000,,,,,-0.1400000
CVESGAK,sno,C,284,true,"hot5-4 / wildtype, FAT-switch S-nitrosoproteome",169,37277371,,,,,,,,
LDKCVESGAK,so,C,284,true,"Arabidopsis S-sulfenylation chemoproteomics",108,31578252,"pFind PSM Score",0.0107241,,1.3508300,,,,0.6683940
CVESGAK,so,C,284,true,"S-sulfenylation site detection using YAP1C",110,32714340,,,,,,,,
LAIGDLATQYFADR,nt,L,296,true,"Arabidopsis translation initiation landscape - NT",167b,35069635,,,,,,,,
LAIGDLATQYFADRDIFCAGR,so,C,313,true,"S-sulfenylation site detection using YAP1C",110,32714340,,,,,,,,
FNIFSGCPSGR,ox,C,367,true,"OxiTRAQ Arabidopsis - 5 mM H2O2 versus control",47,24376095,,,,-0.0521680,0.3601570,NO,,
FNIFSGCPSGR,ox,C,367,true,"SPEAR - 10 mM H2O2 / mock",138a,34619326,,,,0.9333040,0.0170053,YES,,
FNIFSGCPSGR,ox,C,367,true,"SPEAR - 50 mM H2O2 / mock",138b,34619326,,,,1.0726684,0.0025391,YES,,
FNIFSGCPSGR,so,C,367,true,"S-sulfenylation site detection using YAP1C",110,32714340,,,,,,,,
SLHDAIMIVR,nt,S,391,true,"Arabidopsis translation initiation landscape - NT",167b,35069635,,,,,,,,
AVKNSTVVPGGGAIDMEISK,ac,K,404,true,"Quantitative Acetylproteomics",101,29440448,,,,,,,,
TIAGKSQLFINSYAK,ac,K,433,true,"Quantitative Acetylproteomics",101,29440448,,,,,,,,
QLCDNAGFDATDVLNKLR,nt,Q,451,true,"HUNTER N-terminome: legumain, GluC and trypsin",119,31951383,"MaxQuant score",,,,,,,
QLCDNAGFDATDVLNK,ox,C,453,true,"SPEAR - 50 mM H2O2 / mock",138b,34619326,,,,1.4429500,0.0336574,YES,,
QLCDNAGFDATDVLNK,sno,C,453,true,"Site-specific nitrosomeproteomic id - gsnor1-3",90b,25699590,XCorr,2.8482499,,,,,0.036380000412464,-7.0755087
QLCDNAGFDATDVLNK,sno,C,453,true,"hot5-4 / wildtype, FAT-switch S-nitrosoproteome",169,37277371,,,,0.6452416,0.0015470,YES,,
QLCDNAGFDATDVLNK,so,C,453,true,"S-sulfenylation site detection using YAP1C",110,32714340,,,,,,,,
