Peptide,PTM,ModifiedAA,ModifiedPosition,PeptideUniqueToGene,ExperimentDesc,ExpID,PubmedID,ScoreType,IdentScore,LocProb,Log2FChange,PQ-val,QuantSig,PEP,MassErrorPPM
MNDLFSSSFSR,nta,M,1,true,"Characterization plant N-terminal acetylation",6,22223895,"MASCOT Score",51.4200000,,,,,,
MNDLFSSSFSR,nta,M,1,true,"HUNTER N-terminome: legumain, GluC and trypsin",119,31951383,"MaxQuant score",113.6300000,,,,,,
MNDLFSSSFSR,nta,M,1,true,"Arabidopsis translation initiation landscape - NTA",167a,35069635,,,,,,,,
MNDLFSSSFS,nta,M,1,true,"N-term acetylation drought responses",5,26184543,,,,,,,,
MNDLFSSSFSR,ph,S,6,true,"BSK8 and BSL2 regulating sucrose-ph synthase",66,24924143,"MaxQuant Score",133.4800000,,,,,,-0.2556200
MNDLFSSSFSR,ph,S,6,true,"SIRK1 exp - sirk1 mutant vs WT",86b,23820729,,,,0.1778650,,NO,,
MNDLFSSSFSR,ph,S,6,true,"SIRK1 exp - 35S:SIRK1 vs WT",86c,23820729,,,,-0.1869036,,NO,,
MNDLFSSSFSR,ph,S,6,true,"atm and atr DNA damage response",88,25561503,"MASCOT Score",31.0000000,0.8320000,,,,,-0.2300000
MNDLFSSSFSR,ph,S,8,true,"Phosphorylation Early Elicitor Signaling",23,17317660,,,,,,,,
MNDLFSSSFSR,ph,S,8,true,"BSK8 and BSL2 regulating sucrose-ph synthase",66,24924143,"MaxQuant Score",132.7900000,,,,,,-0.3369200
MNDLFSSSFSR,ph,S,8,true,"SIRK1 phosphorylation",86a,23820729,"MaxQuant Score",111.7200000,0.8850000,,,,0.027000000700355,5.5700000
MNDLFSSSFSR,ph,S,8,true,"atm and atr DNA damage response",88,25561503,"MASCOT Score",72.0000000,0.9990000,,,,,-0.2000000
MNDLFSSSFSR,ph,S,8,true,"TOR Kinase and ABA Receptor",100,29290610,XCorr,3.8678894,0.9967000,,,,2.5439999262744E-6,
MNDLFSSSFSR,ph,S,8,true,"Phospho cell culture sucrose/TOR",109,30833711,,,0.8215080,,,,,
MNDLFSSSFSR,ph,S,8,true,"Tissue atlas Arabidopsis - ProteomicsDB",114,32188942,"MaxQuant score",237.4100000,0.9501990,,,,0,
NDLFSSSFSR,ph,S,8,true,"Phosphorylation Early Elicitor Signaling",23,17317660,,,,,,,,
FRSGEPSPR,ph,S,14,true,"atm and atr DNA damage response",88,25561503,"MASCOT Score",22.0000000,1.0000000,,,,,-0.4600000
FRSGEPSPR,ph,S,14,true,"Tissue atlas Arabidopsis - ProteomicsDB",114,32188942,"MaxQuant score",76.3570000,1.0000000,,,,0.0046525499783456,
FRSGEPSPR,ph,S,18,true,"STN8 phosphoproteome",38,21768351,"MASCOT Score",42.5500000,,,,,,-0.2284540
FRSGEPSPR,ph,S,18,true,"Chloroplast kinase substrates",60,19376835,"MASCOT Score",32.3200000,,,,,,-1.8629500
FRSGEPSPR,ph,S,18,true,"atm and atr DNA damage response",88,25561503,"MASCOT Score",22.0000000,1.0000000,,,,,-0.4600000
FRSGEPSPR,ph,S,18,true,"Tissue atlas Arabidopsis - ProteomicsDB",114,32188942,"MaxQuant score",76.3570000,1.0000000,,,,0.0046525499783456,
SGEPSPRR,ph,S,18,true,"atm and atr DNA damage response",88,25561503,"MASCOT Score",28.0000000,0.9930000,,,,,-0.4400000
ANPAGSTGGVNLDKFFE,nt,A,33,true,"N-terminal ChaFRADIC",92,26010716,"MASCOT Score",50.2300000,,,,,3.9940001443028E-5,
ANPAGSTGGVNLDKFFE,nta,A,33,true,"N-terminal ChaFRADIC",92,26010716,"MASCOT Score",50.2300000,,,,,3.9940001443028E-5,
ANPAGSTGGVNLDK,nta,A,33,true,"Characterization plant N-terminal acetylation",6,22223895,"MASCOT Score",79.9500000,,,,,,
RDVAGGGDGVQMANPAGSTGGVNLDK,ph,S,38,true,"Tissue atlas Arabidopsis - ProteomicsDB",114,32188942,"MaxQuant score",295.1700000,0.9604990,,,,0,
RDVAGGGDGVQMANPAGSTGGVNLDK,ph,T,39,true,"Tissue atlas Arabidopsis - ProteomicsDB",114,32188942,"MaxQuant score",94.2640000,0.8189680,,,,2.4263499649094E-16,
LNETLSSCHEQSK,sno,C,71,true,"Site-specific nitrosomeproteomic id - gsnor1-3",90a,25699590,XCorr,2.8908079,,,,,0.0002360999933444,-7.5217862
LNETLSSCHEQSK,sno,C,71,true,"Site-specific nitrosomeproteomic id - gsnor1-3",90b,25699590,XCorr,3.2100000,,,,,0.051210001111031,-6.8200000
LNETLSSCHEQSK,so,C,71,true,"Arabidopsis S-sulfenylation chemoproteomics",108,31578252,"pFind PSM Score",0.0094574,,1.3877700,,,,-1.1083487
TLHNAKAVK,ub,K,82,true,"Ubiquitination Membrane Proteins",120,33585938,,,,,,,,
SKMDGDVGVALKK,ub,K,90,true,"Ubiquitination Membrane Proteins",120,33585938,,,,,,,,
SLPGCGPGSSSDR,ox,C,125,true,"OxiTRAQ Arabidopsis - 5 mM H2O2 versus control",47,24376095,,,,0.0282937,0.6082937,NO,,
SLPGCGPGSSSDR,sno,C,125,true,"hot5-4 / wildtype, FAT-switch S-nitrosoproteome",169,37277371,,,,,,,,
KKLMDSMDSFNR,ub,K,145,true,"Ubiquitination Membrane Proteins",120,33585938,,,,,,,,
LISTGESER,ph,S,190,true,"STN8 phosphoproteome",38,21768351,"MASCOT Score",40.8100000,,,,,,3.7041400
LISTGESER,ph,S,190,true,"Chloroplast kinase substrates",60,19376835,"MASCOT Score",39.5400000,,,,,,3.7041400
LISTGESER,ph,S,190,true,"LAXIC - ABA stress",84a,23660473,XCorr,2.3200000,0.9910000,,,,0.096030600368977,
LISTGESER,ph,S,190,true,"atm and atr DNA damage response",88,25561503,"MASCOT Score",52.0000000,0.9970000,,,,,-0.3100000
LISTGESER,ph,S,190,true,"Protein sumoylation and phosphorylation cross-talk",97,28419593,,,,,,,,
LISTGESER,ph,S,190,true,"Phospho cell culture sucrose/TOR",109,30833711,,,0.9386730,,,,,
LISTGESER,ph,S,190,true,"Tissue atlas Arabidopsis - ProteomicsDB",114,32188942,"MaxQuant score",139.8600000,0.9992350,,,,8.7612097559031E-5,
LISTGESER,ph,S,194,true,"Tissue atlas Arabidopsis - ProteomicsDB",114,32188942,"MaxQuant score",93.8390000,0.9905100,,,,0.0017909000162035,
FLQKAIQEQGR,ac,K,200,false,"Quantitative Acetylproteomics",101,29440448,,,,,,,,
HDAVKDIEK,ac,K,225,false,"Quantitative Acetylproteomics",101,29440448,,,,,,,,
ASSFIRGGTDQLQTAR,ph,S,264,true,"TOR Kinase and ABA Receptor",100,29290610,XCorr,3.4803224,0.8841000,,,,0.00022689999605063,
ASSFIRGGTDQLQTAR,ph,S,264,true,"Tissue atlas Arabidopsis - ProteomicsDB",114,32188942,"MaxQuant score",71.0730000,0.8765180,,,,0.00012557799345814,
ASSFIR,ph,S,264,false,"TOR Kinase and ABA Receptor",100,29290610,XCorr,2.2871675,0.9942000,,,,0.004422000143677,
