Peptide,PTM,ModifiedAA,ModifiedPosition,PeptideUniqueToGene,ExperimentDesc,ExpID,PubmedID,ScoreType,IdentScore,LocProb,Log2FChange,PQ-val,QuantSig,PEP,MassErrorPPM
QNQSVENLLLLGK,ph,S,7,true,"atm and atr DNA damage response",88,25561503,"MASCOT Score",53.0000000,1.0000000,,,,,0.2800000
QNQSVENLLLLGK,ph,S,7,true,"TOR Kinase and ABA Receptor",100,29290610,XCorr,2.8761466,1.0000000,,,,0.0070949997752905,
QNQSVENLLLLGK,ph,S,7,true,"Tissue atlas Arabidopsis - ProteomicsDB",114,32188942,"MaxQuant score",313.9000000,1.0000000,,,,0,
QNQSVENLLLLGK,ph,S,7,true,"Touch-induced phosphorylation: 40s touch vs untouc",136,30291188,"MASCOT score",79.8000000,,-0.1640471,0.7360073,NO,,-1.7091079
GCSSPTSSTSSILR,ph,S,24,true,"Large-scale phosphorylation discovery",44,23111157,XCorr,3.9600000,,,,,,
GCSSPTSSTSSILR,ph,S,24,true,"Tissue atlas Arabidopsis - ProteomicsDB",114,32188942,"MaxQuant score",161.2100000,0.9956260,,,,1.1164100199856E-10,
AIVVGKR,ac,K,47,true,"Quantitative Acetylproteomics",101,29440448,,,,,,,,
RGGSTTPVPTWR,ph,S,51,true,"atm and atr DNA damage response",88,25561503,"MASCOT Score",36.0000000,1.0000000,,,,,-0.3300000
RGGSTTPVPTWR,ph,T,52,true,"atm and atr DNA damage response",88,25561503,"MASCOT Score",36.0000000,0.9910000,,,,,-0.3300000
GGSTTPVPTWR,ph,T,52,true,"Tissue atlas Arabidopsis - ProteomicsDB",114,32188942,"MaxQuant score",104.8200000,0.9060960,,,,0.00014136399840936,
GGSTTPVPTWR,ph,T,53,true,"Tissue atlas Arabidopsis - ProteomicsDB",114,32188942,"MaxQuant score",92.9430000,0.9450860,,,,0.000680570024997,
ASGALHAAASPSSHCGSK,ph,S,78,true,"TOR Kinase and ABA Receptor",100,29290610,XCorr,3.3401828,0.9874000,,,,0.0067830001935363,
ASGALHAAASPSSHCGSK,ph,S,78,true,"Tissue atlas Arabidopsis - ProteomicsDB",114,32188942,"MaxQuant score",207.1300000,0.9993340,,,,0,
VSAPAPVSAR,ph,S,97,true,"Tissue atlas Arabidopsis - ProteomicsDB",114,32188942,"MaxQuant score",125.0300000,1.0000000,,,,9.1334397438914E-5,
LAATLWEMNEMPSPR,ph,S,113,true,"Tissue atlas Arabidopsis - ProteomicsDB",114,32188942,"MaxQuant score",178.4000000,1.0000000,,,,5.3283698435931E-27,
SSVHSGSLPPHLSDPSHSPVSER,ph,S,157,true,"Tissue atlas Arabidopsis - ProteomicsDB",114,32188942,"MaxQuant score",127.2400000,0.9234850,,,,1.9618800318891E-22,
SSVHSGSLPPHLSDPSHSPVSER,ph,S,160,true,"Tissue atlas Arabidopsis - ProteomicsDB",114,32188942,"MaxQuant score",53.4820000,0.8307070,,,,0.00053920800564811,
SRVETPTGSTVGVK,ph,S,207,true,"atm and atr DNA damage response",88,25561503,"MASCOT Score",50.0000000,1.0000000,,,,,-0.1900000
SRVETPTGSTVGVK,ph,S,207,true,"TOR Kinase and ABA Receptor",100,29290610,XCorr,3.0201337,0.9966000,,,,0.088930003345013,
SRVETPTGSTVGVK,ph,S,207,true,"Tissue atlas Arabidopsis - ProteomicsDB",114,32188942,"MaxQuant score",176.8200000,0.9999930,,,,2.4469400123682E-16,
SRVETPTGSTVGVK,ph,T,211,true,"atm and atr DNA damage response",88,25561503,"MASCOT Score",50.0000000,1.0000000,,,,,0.1400000
VETPTGSTVGVK,ph,T,211,true,"Tissue atlas Arabidopsis - ProteomicsDB",114,32188942,"MaxQuant score",141.2200000,0.9998140,,,,9.1180299932603E-5,
SRVETPTGSTVGVK,ph,T,213,true,"TOR Kinase and ABA Receptor",100,29290610,XCorr,3.0201337,0.8610000,,,,0.088930003345013,
SRVETPTGSTVGVK,ph,S,215,true,"atm and atr DNA damage response",88,25561503,"MASCOT Score",43.0000000,0.9940000,,,,,-0.1600000
DISEDKAEVEELKR,ph,S,375,true,"Tissue atlas Arabidopsis - ProteomicsDB",114,32188942,"MaxQuant score",113.8600000,1.0000000,,,,2.0161300199106E-5,
KSLSLQR,ph,S,527,true,"Tissue atlas Arabidopsis - ProteomicsDB",114,32188942,"MaxQuant score",78.9320000,0.9999670,,,,0.018189800903201,
KSLSLQR,ph,S,529,true,"Tissue atlas Arabidopsis - ProteomicsDB",114,32188942,"MaxQuant score",94.0870000,0.9998660,,,,0.015855899080634,
SISDCVDWVVQSEK,ph,S,535,true,"srk2dei ABA signaling phopshoproteomics",83,23572148,"MASCOT Score",53.0000000,,,,,,0.0001000
SISDCVDWVVQSEK,ph,S,535,true,"SnRK2 protein kinase substrates",85,23776212,XCorr,3.0879149,0.9560000,,,,3.96250006599E-16,
SISDCVDWVVQSEK,ph,S,535,true,"Tissue atlas Arabidopsis - ProteomicsDB",114,32188942,"MaxQuant score",316.1000000,0.9999990,,,,0,
SGDGGLDWGR,ph,S,550,true,"Tissue atlas Arabidopsis - ProteomicsDB",114,32188942,"MaxQuant score",76.3320000,1.0000000,,,,0.0038581499829888,
SRLSDASKGENQNAR,ph,S,607,true,"Tissue atlas Arabidopsis - ProteomicsDB",114,32188942,"MaxQuant score",58.8350000,0.9795660,,,,0.0012452800292522,
SRLSDASK,ph,S,607,true,"atm and atr DNA damage response",88,25561503,"MASCOT Score",20.0000000,1.0000000,,,,,-1.5100000
SRLSDASKGENQNAR,ph,S,610,true,"Tissue atlas Arabidopsis - ProteomicsDB",114,32188942,"MaxQuant score",58.8350000,0.9997870,,,,0.0012452800292522,
