Peptide,PTM,ModifiedAA,ModifiedPosition,PeptideUniqueToGene,ExperimentDesc,ExpID,PubmedID,ScoreType,IdentScore,LocProb,Log2FChange,PQ-val,QuantSig,PEP,MassErrorPPM
SKRKTKEPKV,nt,S,2,false,"N-term acetylation drought responses",5,26184543,,,,,,,,
SKRKTKEPKVETVTL,nta,S,2,true,"Arabidopsis translation initiation landscape - NTA",167a,35069635,,,,,,,,
SKRKTKEPKV,nta,S,2,false,"N-term acetylation drought responses",5,26184543,,,,,,,,
KTKEPKVETVTLGPSVR,ub,K,10,true,"Arabidopsis ubiquitination COFRADIC",40,26744219,"MaxQuant Score",60.0620000,0.9850000,,,,1.3320000391559E-7,0.0310000
TVTLGPSVRE,nt,T,13,true,"Arg/N-end rule seed, prt6 vs. Wt",99,29168982,"MASCOT Score",20.8000000,,-0.0443641,0.7448250,NO,0.003575999988243,-1.5457905
VETVTLGPSVR,ph,T,13,true,"Tissue atlas Arabidopsis - ProteomicsDB",114,32188942,"MaxQuant score",170.6800000,0.9957540,,,,3.6088600857687E-11,
VETVTLGPSVR,ph,T,15,true,"Tissue atlas Arabidopsis - ProteomicsDB",114,32188942,"MaxQuant score",206.2100000,0.9997900,,,,4.4432499767569E-24,
VETVTLGPSVR,ph,S,19,true,"STN8 phosphoproteome",38,21768351,"MASCOT Score",50.9000000,,,,,,0.2362440
VETVTLGPSVR,ph,S,19,true,"Large-scale phosphorylation discovery",44,23111157,XCorr,4.2080000,,,,,,
VETVTLGPSVR,ph,S,19,true,"Chloroplast kinase substrates",60,19376835,"MASCOT Score",49.0100000,,,,,,-0.5872490
VETVTLGPSVR,ph,S,19,true,"SnRK2 protein kinase substrates",85,23776212,XCorr,2.3366735,1.0000000,,,,0.0042301500216126,
VETVTLGPSVR,ph,S,19,true,"atm and atr DNA damage response",88,25561503,"MASCOT Score",71.0000000,1.0000000,,,,,-0.0300000
VETVTLGPSVR,ph,S,19,true,"TOR Kinase and ABA Receptor",100,29290610,XCorr,3.8353553,0.9917000,,,,2.4759999632806E-6,
VETVTLGPSVR,ph,S,19,true,"Lateral root-induction - NAA vs control",106,23328941,"MASCOT Score",26.0000000,,,,,,
VETVTLGPSVR,ph,S,19,true,"Tissue atlas Arabidopsis - ProteomicsDB",114,32188942,"MaxQuant score",115.0600000,0.9999990,,,,3.6419300158741E-5,
ASFNDTFIHVTDLSGR,nt,A,34,false,"Arg/N-end rule pathway Roots",80,25728785,"MASCOT Score",38.0100000,,,,,0.0048279999755323,
SFNDTFIHVTDLSGR,nt,S,35,false,"Arg/N-end rule pathway Roots",80,25728785,"MASCOT Score",34.7400000,,,,,0.0025319999549538,
TLVRITGGMKVKADRDE,nt,T,51,false,"Arabidopsis translation initiation landscape - NT",167b,35069635,,,,,,,,
ITGGMKVKADR,ub,K,60,false,"Arabidopsis ubiquitination COFRADIC",40,26744219,"MaxQuant Score",71.1760000,0.9620000,,,,0.00053989997832105,-0.3050000
ITGGMKVKADR,ub,K,62,false,"Arabidopsis ubiquitination COFRADIC",40,26744219,"MaxQuant Score",63.0910000,0.9560000,,,,0.0010000000474975,-0.3470000
LAAQDVAQR,nt,L,75,false,"Arg/N-end rule seed, prt6 vs. Wt",99,29168982,"MASCOT Score",43.2400000,,,,,0.091779999434948,-0.2647077
LAAQDVAQR,nta,L,75,false,"Arg/N-end rule seed, prt6 vs. Wt",99,29168982,"MASCOT Score",43.2400000,,,,,0.091779999434948,-0.2647077
CKELGITAMHVK,so,C,84,false,"S-sulfenylation site detection using YAP1C",110,32714340,,,,,,,,
ELGITAMHVKLR,ac,K,95,false,"Quantitative Acetylproteomics",101,29440448,,,,,,,,
ATGGNKTKTPGPGAQSALR,ub,K,105,false,"Arabidopsis ubiquitination COFRADIC",40,26744219,"MaxQuant Score",66.8930000,0.8500000,,,,1.6729999818225E-13,-0.1130000
SGMKIGR,ub,K,124,false,"Arabidopsis ubiquitination COFRADIC",40,26744219,"MaxQuant Score",71.2960000,1.0000000,,,,0.013000000268221,-0.6290000
IEDVTPIPTDSTR,nt,I,128,false,"Stromal N-terminome",96,26371235,"MASCOT Score",54.5300000,,,,,,
IEDVTPIPTDSTR,ph,T,136,false,"Tissue atlas Arabidopsis - ProteomicsDB",114,32188942,"MaxQuant score",121.7600000,0.7800520,,,,0.00017907599976752,
IEDVTPIPTDSTRR,ph,S,138,false,"atm and atr DNA damage response",88,25561503,"MASCOT Score",48.0000000,0.9500000,,,,,-0.9800000
IEDVTPIPTDSTR,ph,S,138,false,"atm and atr DNA damage response",88,25561503,"MASCOT Score",39.0000000,0.9960000,,,,,0.7600000
IEDVTPIPTDSTR,ph,S,138,false,"Tissue atlas Arabidopsis - ProteomicsDB",114,32188942,"MaxQuant score",162.7000000,0.7711360,,,,2.2564400348202E-10,
