Peptide,PTM,ModifiedAA,ModifiedPosition,PeptideUniqueToGene,ExperimentDesc,ExpID,PubmedID,ScoreType,IdentScore,LocProb,Log2FChange,PQ-val,QuantSig,PEP,MassErrorPPM
AAAAVSSNPRTVEE,nt,A,2,true,"Arg/N-end rule seed, prt6 vs. Wt",99,29168982,"MASCOT Score",39.8000000,,,,,3.2570000030319E-7,-6.8774347
AAAAVSSNPRTVE,nt,A,2,true,"Arg/N-end rule seed, prt6 vs. Wt",99,29168982,"MASCOT Score",35.1600000,,,,,9.5639995834063E-7,3.4022411
AAAAVSSNPR,nt,A,2,true,"N-term acetylation drought responses",5,26184543,,,,,,,,
AAAAVSSNPR,nt,A,2,true,"Tic56 chloroplast import - tic56-1",89c,25588737,XCorr,2.8220251,,,,,,
AAAAVSSNPR,nt,A,2,true,"Arg/N-end rule seed, prt6 vs. Wt",99,29168982,"MASCOT Score",44.2700000,,,,,0.091349996626377,-0.5311658
AAAAVSSNPRTVEEIFKDY,nta,A,2,true,"Arabidopsis translation initiation landscape - NTA",167a,35069635,,,,,,,,
AAAAVSSNPRTVEE,nta,A,2,true,"Arg/N-end rule seed, prt6 vs. Wt",99,29168982,"MASCOT Score",39.8000000,,,,,3.2570000030319E-7,-6.8774347
AAAAVSSNPRTVEE,nta,A,2,true,"HUNTER N-terminome: legumain, GluC and trypsin",119,31951383,"MaxQuant score",194.9600000,,,,,,
AAAAVSSNPRTVE,nta,A,2,true,"Arg/N-end rule seed, prt6 vs. Wt",99,29168982,"MASCOT Score",35.1600000,,,,,9.5639995834063E-7,3.4022411
AAAAVSSNPR,nta,A,2,true,"N-term acetylation drought responses",5,26184543,,,,,,,,
AAAAVSSNPR,nta,A,2,true,"Characterization plant N-terminal acetylation",6,22223895,"MASCOT Score",90.1000000,,,,,,
AAAAVSSNPR,nta,A,2,true,"Arg/N-end rule pathway Roots",80,25728785,"MASCOT Score",61.9400000,,,,,0.0003994999860879,
AAAAVSSNPR,nta,A,2,true,"Tic56 chloroplast import - tic56-1",89c,25588737,XCorr,2.8220251,,,,,,
AAAAVSSNPR,nta,A,2,true,"Arg/N-end rule seed, prt6 vs. Wt",99,29168982,"MASCOT Score",44.2700000,,,,,0.091349996626377,-0.5311658
AAAVSSNPR,nt,A,3,true,"Arg/N-end rule seed, prt6 vs. Wt",99,29168982,"MASCOT Score",59.5500000,,,,,0.041450001299381,-0.6942965
AAAVSSNPRTVEE,nta,A,3,true,"Arabidopsis translation initiation landscape - NTA",167a,35069635,,,,,,,,
AAAVSSNPR,nta,A,3,true,"Characterization plant N-terminal acetylation",6,22223895,"MASCOT Score",60.7100000,,,,,,
AAAVSSNPR,nta,A,3,true,"Arg/N-end rule seed, prt6 vs. Wt",99,29168982,"MASCOT Score",59.5500000,,,,,0.041450001299381,-0.6942965
TVEEIFKDYSAR,ub,K,18,true,"upl3 mutant / wildtype",168,35926874,"MaxQuant score",129.3400000,1.0000000,-0.2863042,,,1.5112799474082E-6,-0.0325940
AMKDNKPSSDSGSK,ac,K,143,true,"Histone deacetylases- hda14 vs WT (low light)",98c,29061669,"MaxQuant Score",128.0600000,1.0000000,-2.2500000,0.9885531,NO,1.399999973728E-6,
DNKPSSDSGSK,ph,S,149,true,"atm and atr DNA damage response",88,25561503,"MASCOT Score",29.0000000,0.9950000,,,,,-1.2100000
DNKPSSDSGSK,ph,S,151,true,"atm and atr DNA damage response",88,25561503,"MASCOT Score",35.0000000,0.8870000,,,,,0.9600000
DNKPSSDSGSK,ph,S,153,true,"atm and atr DNA damage response",88,25561503,"MASCOT Score",34.0000000,1.0000000,,,,,4.7600000
DNKPSSDSGSKSR,ac,K,154,true,"Quantitative Acetylproteomics",101,29440448,,,,,,,,
SIDGQTKSSTPK,ac,K,168,true,"Quantitative Acetylproteomics",101,29440448,,,,,,,,
