Peptide,PTM,ModifiedAA,ModifiedPosition,PeptideUniqueToGene,ExperimentDesc,ExpID,PubmedID,ScoreType,IdentScore,LocProb,Log2FChange,PQ-val,QuantSig,PEP,MassErrorPPM
VIASAEKHQAK,ac,K,42,true,"Quantitative Acetylproteomics",101,29440448,,,,,,,,
FVLTTHHHWDHAGGNEKIK,ub,K,65,true,"upl3 mutant / wildtype",168,35926874,"MaxQuant score",90.3790000,1.0000000,0.9642138,,,2.2112300257504E-7,-0.1774200
VYGGSLDKVK,ub,K,82,true,"upl3 mutant / wildtype",168,35926874,"MaxQuant score",47.3020000,1.0000000,0.3357119,,,0.008881020359695,0.3587400
EGENPAVFTGDTLFVAGCGK,ox,C,142,true,"SPEAR - 50 mM H2O2 / mock",138b,34619326,,,,1.2577257,0.0365710,YES,,
EGENPAVFTGDTLFVAGCGK,so,C,142,true,"S-sulfenylation site detection using YAP1C",110,32714340,,,,,,,,
LGCKSPIDTMR,so,C,239,true,"S-sulfenylation site detection using YAP1C",110,32714340,,,,,,,,
LGCKSPIDTMR,ph,S,241,true,"Large-scale phosphorylation discovery",44,23111157,XCorr,2.9310000,,,,,,
LGCKSPIDTMR,ph,S,241,true,"srk2dei ABA signaling phopshoproteomics",83,23572148,"MASCOT Score",35.0000000,,,,,,0.0000000
LGCKSPIDTMR,ph,S,241,true,"atm and atr DNA damage response",88,25561503,"MASCOT Score",27.0000000,1.0000000,,,,,-0.5700000
LGCKSPIDTMR,ph,S,241,true,"Phospho cell culture sucrose/TOR",109,30833711,,,0.9999170,,,,,
LGCKSPIDTMR,ph,S,241,true,"Tissue atlas Arabidopsis - ProteomicsDB",114,32188942,"MaxQuant score",151.2200000,1.0000000,,,,2.4222099881399E-8,
