Peptide,PTM,ModifiedAA,ModifiedPosition,PeptideUniqueToGene,ExperimentDesc,ExpID,PubmedID,ScoreType,IdentScore,LocProb,Log2FChange,PQ-val,QuantSig,PEP,MassErrorPPM
ASSVSSAVDSDSLVEDRDDVGRIPLLE,nt,A,67,true,"N-terminal ChaFRADIC",92,26010716,"MASCOT Score",46.7000000,,,,,1.9799999417813E-9,
ASSVSSAVDSDSLVEDRDDVGRIPL,nt,A,67,true,"Arabidopsis translation initiation landscape - NT",167b,35069635,,,,,,,,
ASSVSSAVDSDSLVEDRDDVGR,nt,A,67,true,"Stromal N-terminome",96,26371235,"MASCOT Score",57.9900000,,,,,,
ASSVSSAVDSDSLVEDRDD,nt,A,67,true,"HUNTER N-terminome: legumain, GluC and trypsin",119,31951383,"MaxQuant score",93.4940000,,,,,,
ASSVSSAVDSDSLVEDRD,nt,A,67,true,"HUNTER N-terminome: legumain, GluC and trypsin",119,31951383,"MaxQuant score",147.2600000,,,,,,
ASSVSSAVDSDSLVEDR,nt,A,67,true,"Arg/N-end rule pathway Roots",80,25728785,"MASCOT Score",111.0300000,,,,,3.0019999615501E-14,
ASSVSSAVDSDSLVEDR,nt,A,67,true,"Stromal N-terminome",96,26371235,"MASCOT Score",108.1900000,,,,,,
ASSVSSAVDSDSLVEDR,nt,A,67,true,"Arg/N-end rule seed, prt6 vs. Wt",99,29168982,"MASCOT Score",85.7900000,,-0.1586155,0.3693196,NO,0.00010710000060499,4.9983542
ASSVSSAVDSDSLVEDR,nt,A,67,true,"HUNTER N-terminome: legumain, GluC and trypsin",119,31951383,"MaxQuant score",189.3000000,,,,,,
ASSVSSAVDSDSLVE,nt,A,67,true,"Arg/N-end rule seed, prt6 vs. Wt",99,29168982,"MASCOT Score",47.4900000,,-0.1505541,0.5175830,NO,9.1350002549007E-6,-2.6664373
ASSVSSAVDSDSLVE,nt,A,67,true,"HUNTER N-terminome: legumain, GluC and trypsin",119,31951383,"MaxQuant score",148.9600000,,,,,,
ASSVSSAVDSDSLVEDRDDVGRIPLLE,nta,A,67,true,"N-terminal ChaFRADIC",92,26010716,"MASCOT Score",39.8900000,,,,,2.9040000299574E-5,
ASSVSSAVDSDSLVEDRDDVGRIPLLE,nta,A,67,true,"HUNTER N-terminome: legumain, GluC and trypsin",119,31951383,"MaxQuant score",96.9030000,,,,,,
ASSVSSAVDSDSLVEDRDDVGRIPL,nta,A,67,true,"Arabidopsis translation initiation landscape - NTA",167a,35069635,,,,,,,,
ASSVSSAVDSDSLVEDRDD,nta,A,67,true,"HUNTER N-terminome: legumain, GluC and trypsin",119,31951383,"MaxQuant score",115.8000000,,,,,,
ASSVSSAVDSDSLVEDRD,nta,A,67,true,"HUNTER N-terminome: legumain, GluC and trypsin",119,31951383,"MaxQuant score",153.3900000,,,,,,
ASSVSSAVDSDSLVEDR,nta,A,67,true,"Stromal N-terminome",96,26371235,"MASCOT Score",58.1200000,,,,,,
ASSVSSAVDSDSLVEDR,nta,A,67,true,"Arg/N-end rule seed, prt6 vs. Wt",99,29168982,"MASCOT Score",85.7900000,,,,,0.00010710000060499,4.9983542
ASSVSSAVDSDSLVEDR,nta,A,67,true,"FtsH12 N-terminome: WT / FtsH12 knockdown miRNA",118,33216923,"MaxQuant score",239.8200000,,,,,0,
ASSVSSAVDSDSLVEDR,nta,A,67,true,"HUNTER N-terminome: legumain, GluC and trypsin",119,31951383,"MaxQuant score",136.2400000,,,,,,
ASSVSSAVDSDSLVE,nta,A,67,true,"HUNTER N-terminome: legumain, GluC and trypsin",119,31951383,"MaxQuant score",148.3200000,,,,,,
SSVSSAVDSDSLVEDRDDVGRIPLLEVRDL,nt,S,68,true,"Arabidopsis translation initiation landscape - NT",167b,35069635,,,,,,,,
SSVSSAVDSDSLVEDRDDVGRIPLLEVR,nt,S,68,true,"N-terminal ChaFRADIC",92,26010716,"MASCOT Score",36.4200000,,,,,1.2150000117117E-8,
SSVSSAVDSDSLVEDRDDVGRIPLLE,nt,S,68,true,"N-terminal ChaFRADIC",92,26010716,"MASCOT Score",35.2200000,,,,,6.6969998435695E-9,
SSVSSAVDSDSLVEDRDDVGRIPLLE,nt,S,68,true,"HUNTER N-terminome: legumain, GluC and trypsin",119,31951383,"MaxQuant score",93.9660000,,,,,,
SSVSSAVDSDSLVEDRDDVGR,nt,S,68,true,"Stromal N-terminome",96,26371235,"MASCOT Score",65.7500000,,,,,,
SSVSSAVDSDSLVEDRDD,nt,S,68,true,"HUNTER N-terminome: legumain, GluC and trypsin",119,31951383,"MaxQuant score",102.9000000,,,,,,
SSVSSAVDSDSLVEDRD,nt,S,68,true,"HUNTER N-terminome: legumain, GluC and trypsin",119,31951383,"MaxQuant score",143.2500000,,,,,,
SSVSSAVDSDSLVEDR,nt,S,68,true,"N-terminal ChaFRADIC",92,26010716,"MASCOT Score",61.1100000,,,,,1.3970000622976E-7,
SSVSSAVDSDSLVEDR,nt,S,68,true,"Stromal N-terminome",96,26371235,"MASCOT Score",124.2000000,,,,,,
SSVSSAVDSDSLVEDR,nt,S,68,true,"Arg/N-end rule seed, prt6 vs. Wt",99,29168982,"MASCOT Score",116.1200000,,-0.6204176,0.0475347,NO,1.9029999975828E-7,-1.8031976
SSVSSAVDSDSLVEDR,nt,S,68,true,"FtsH12 N-terminome: WT / FtsH12 knockdown miRNA",118,33216923,"MaxQuant score",156.2900000,,,,,0,
SSVSSAVDSDSLVEDR,nt,S,68,true,"HUNTER N-terminome: legumain, GluC and trypsin",119,31951383,"MaxQuant score",211.3800000,,,,,,
SSVSSAVDSDSLVE,nt,S,68,true,"Arg/N-end rule seed, prt6 vs. Wt",99,29168982,"MASCOT Score",59.1500000,,-0.0168555,0.8828535,NO,4.1500002225803E-6,0.2538789
SSVSSAVDSDSLVE,nt,S,68,true,"HUNTER N-terminome: legumain, GluC and trypsin",119,31951383,"MaxQuant score",136.6300000,,,,,,
SSVSSAVDSDSLVEDR,nta,S,68,true,"HUNTER N-terminome: legumain, GluC and trypsin",119,31951383,"MaxQuant score",86.7720000,,,,,,
SAVDSDSLVEDR,nt,S,72,true,"Arg/N-end rule seed, prt6 vs. Wt",99,29168982,"MASCOT Score",42.6500000,,-1.4997255,0.1332585,NO,0.027429999783635,-4.5028506
AVDSDSLVEDR,nt,A,73,true,"Arg/N-end rule seed, prt6 vs. Wt",99,29168982,"MASCOT Score",43.0100000,,0.2209825,0.3965485,NO,0.011719999834895,-0.0632729
IIKTGDNSLAK,ac,K,318,true,"Quantitative Acetylproteomics",101,29440448,,,,,,,,
