Peptide,PTM,ModifiedAA,ModifiedPosition,PeptideUniqueToGene,ExperimentDesc,ExpID,PubmedID,ScoreType,IdentScore,LocProb,Log2FChange,PQ-val,QuantSig,PEP,MassErrorPPM
ADGGPTVDDLGHHAGYYKLPKSR,nt,A,88,true,"Arabidopsis translation initiation landscape - NT",167b,35069635,,,,,,,,
ADGGPTVDDL,nt,A,88,true,"N-terminal ChaFRADIC",92,26010716,"MASCOT Score",80.2900000,,,,,7.4200001698443E-10,
DGGPTVDDLGHHAGYYKLPKSR,nt,D,89,true,"Arabidopsis translation initiation landscape - NT",167b,35069635,,,,,,,,
DGGPTVDDL,nt,D,89,true,"N-terminal ChaFRADIC",92,26010716,"MASCOT Score",57.0000000,,,,,9.6019997727126E-5,
SYAGHYIPAFA,nt,S,229,true,"N-terminal ChaFRADIC",92,26010716,"MASCOT Score",31.8100000,,,,,0.0014919999521226,
SRVHKGNKANE,nt,S,240,true,"Arabidopsis translation initiation landscape - NT",167b,35069635,,,,,,,,
IVPLCELSIK,sno,C,300,true,"hot5-4 / wildtype, FAT-switch S-nitrosoproteome",169,37277371,,,,,,,,
IVPLCELSIK,so,C,300,true,"S-sulfenylation site detection using YAP1C",110,32714340,,,,,,,,
