Peptide,PTM,ModifiedAA,ModifiedPosition,PeptideUniqueToGene,ExperimentDesc,ExpID,PubmedID,ScoreType,IdentScore,LocProb,Log2FChange,PQ-val,QuantSig,PEP,MassErrorPPM
ATSRLQLE,nt,A,2,true,"Arg/N-end rule seed, prt6 vs. Wt",99,29168982,"MASCOT Score",25.0000000,,,,,0.056249998509884,-0.3219094
ATSRLQLEGDD,nta,A,2,true,"HUNTER N-terminome: legumain, GluC and trypsin",119,31951383,"MaxQuant score",164.4300000,,,,,,
ATSRLQLEG,nta,A,2,true,"Arabidopsis translation initiation landscape - NTA",167a,35069635,,,,,,,,
ATSRLQLE,nta,A,2,true,"Arg/N-end rule seed, prt6 vs. Wt",99,29168982,"MASCOT Score",25.0000000,,,,,0.056249998509884,-0.3219094
ATSRLQLE,nta,A,2,true,"HUNTER N-terminome: legumain, GluC and trypsin",119,31951383,"MaxQuant score",137.9000000,,,,,,
FSPQMSVEAVK,ph,S,33,true,"Tissue atlas Arabidopsis - ProteomicsDB",114,32188942,"MaxQuant score",102.3300000,0.9999900,,,,6.8823799665552E-5,
YNISEEDYAK,ph,S,117,true,"Tissue atlas Arabidopsis - ProteomicsDB",114,32188942,"MaxQuant score",154.4100000,1.0000000,,,,9.6138694516412E-7,
RVSQNPVAAEAK,ph,S,137,true,"Tissue atlas Arabidopsis - ProteomicsDB",114,32188942,"MaxQuant score",90.3480000,1.0000000,,,,0.00029814400477335,
TKENYMEDLCANIK,sno,C,156,true,"Site-specific nitrosomeproteomic id - gsnor1-3",90b,25699590,XCorr,4.2900000,,,,,0.012880000285804,-6.3300000
GMVKYVGR,nt,G,174,true,"Arabidopsis translation initiation landscape - NT",167b,35069635,,,,,,,,
GMVKYVGR,ub,K,177,true,"Arabidopsis ubiquitination COFRADIC",40,26744219,"MaxQuant Score",45.0810000,1.0000000,,,,0.025000000372529,0.2780000
