Peptide,PTM,ModifiedAA,ModifiedPosition,PeptideUniqueToGene,ExperimentDesc,ExpID,PubmedID,ScoreType,IdentScore,LocProb,Log2FChange,PQ-val,QuantSig,PEP,MassErrorPPM
STVSKSPTAFSFGSASSSSGQDCK,ph,S,24,true,"Tissue atlas Arabidopsis - ProteomicsDB",114,32188942,"MaxQuant score",185.9300000,0.9056590,,,,0,
SPTAFSFGSASSSSGQDCK,ph,S,29,true,"Phosphorylation Early Elicitor Signaling",23,17317660,,,,,,,,
VVSLDPARDSTELK,ph,S,141,true,"Tyrosine phosphorylation in Arabidopsis",59,18463617,"MASCOT Score",48.0000000,,,,,,-0.8702276
VVSLDPARDSTELK,ph,S,141,true,"Conserved plant phosphoproteome - Arabidopsis",61a,20466843,"MASCOT Score",52.0000000,1.0000000,,,,,
VVSLDPARDSTELK,ph,S,141,true,"TOR Kinase and ABA Receptor",100,29290610,XCorr,3.9348938,0.9360000,,,,0.012020000256598,
VVSLDPARDSTELK,ph,S,141,true,"Phospho cell culture sucrose/TOR",109,30833711,,,0.9822820,,,,,
VVSLDPARDSTELK,ph,S,141,true,"Tissue atlas Arabidopsis - ProteomicsDB",114,32188942,"MaxQuant score",170.7800000,0.9908610,,,,1.8285200929075E-15,
VFSTIGDER,ph,S,169,true,"Tissue atlas Arabidopsis - ProteomicsDB",114,32188942,"MaxQuant score",116.5500000,0.9926600,,,,0.00036527600605041,
