Peptide,PTM,ModifiedAA,ModifiedPosition,PeptideUniqueToGene,ExperimentDesc,ExpID,PubmedID,ScoreType,IdentScore,LocProb,Log2FChange,PQ-val,QuantSig,PEP,MassErrorPPM
MQAVSVDETKNTVVLR,nta,M,1,true,"Arg/N-end rule pathway Roots",80,25728785,"MASCOT Score",86.0400000,,,,,1.7790000583773E-8,
MQAVSVDETKNTVVLR,nta,M,1,true,"Arg/N-end rule seed, prt6 vs. Wt",99,29168982,"MASCOT Score",76.2200000,,-0.1669714,0.0666157,NO,0.00083239999366924,-1.0119952
MQAVSVDETKNTVVLR,nta,M,1,true,"Arabidopsis translation initiation landscape - NTA",167a,35069635,,,,,,,,
MQAVSVDETKN,nta,M,1,true,"Arg/N-end rule seed, prt6 vs. Wt",99,29168982,"MASCOT Score",64.1400000,,-0.2075145,0.3852373,NO,0.0077169998548925,-1.5710566
MQAVSVDETK,nta,M,1,true,"N-term acetylation drought responses",5,26184543,,,,,,,,
MQAVSVDETK,nta,M,1,true,"Characterization plant N-terminal acetylation",6,22223895,"MASCOT Score",68.7300000,,,,,,
MQAVSVDETKNTVVLR,ph,S,5,true,"Tissue atlas Arabidopsis - ProteomicsDB",114,32188942,"MaxQuant score",170.9100000,0.9999990,,,,5.9180397818211E-20,
MQAVSVDETKNTVVLR,ub,K,10,true,"Arabidopsis ubiquitination COFRADIC",40,26744219,"MaxQuant Score",203.0400000,1.0000000,,,,0,-0.0880000
KSVDKFEVKTR,ub,K,26,true,"Arabidopsis ubiquitination COFRADIC",40,26744219,"MaxQuant Score",46.8800000,1.0000000,,,,0.0040000001899898,1.7800000
SVDKFEVK,ph,S,27,true,"Ethylene-regulated phosphorylation ein2 mutant",30,19253305,"MASCOT Score",51.1111000,,,,,,-0.4738416
SVDKFEVK,ph,S,27,true,"Phosphoproteome ethylene-regulated time response",46,24043427,"MASCOT Score",38.1700000,,,,,,-3.0951000
SVDKFEVK,ph,S,27,true,"Tyrosine phosphorylation in Arabidopsis",59,18463617,"MASCOT Score",33.0000000,,,,,,-0.0970428
SVDKFEVK,ph,S,27,true,"srk2dei ABA signaling phopshoproteomics",83,23572148,"MASCOT Score",43.0000000,,,,,,0.0004000
SVDKFEVK,ph,S,27,true,"atm and atr DNA damage response",88,25561503,"MASCOT Score",26.0000000,1.0000000,,,,,0.1800000
SVDKFEVK,ph,S,27,true,"Protein sumoylation and phosphorylation cross-talk",97,28419593,,,,,,,,
SVDKFEVK,ph,S,27,true,"TOR Kinase and ABA Receptor",100,29290610,XCorr,2.1248059,1.0000000,,,,0.0028979999478906,
SVDKFEVK,ph,S,27,true,"Phospho cell culture sucrose/TOR",109,30833711,,,1.0000000,,,,,
SVDKFEVK,ph,S,27,true,"Col-0 callus - FC Col-0 vs. Col-0 Xray",111a,31410901,,36.0400000,,-2.0786670,0.0000000,NO,,0.1444241
SVDKFEVK,ph,S,27,true,"Col-0 X-ray callus - FC Col-0 vs. Col-0 Xray",111b,31410901,,36.0400000,,-2.0786670,0.0000000,NO,,0.1444241
SVDKFEVK,ph,S,27,true,"atm callus - FC atm vs. atm Xray",111c,31410901,,36.0400000,,0.9312838,0.0000000,NO,,0.1444241
SVDKFEVK,ph,S,27,true,"atm-3 X-ray callus - FC atm vs. atm Xray",111d,31410901,,36.0400000,,0.9312838,0.0000000,NO,,0.1444241
SVDKFEVK,ph,S,27,true,"Tissue atlas Arabidopsis - ProteomicsDB",114,32188942,"MaxQuant score",172.8800000,1.0000000,,,,3.4755601518555E-5,
KSVDKFEVKTR,ub,K,30,true,"Arabidopsis ubiquitination COFRADIC",40,26744219,"MaxQuant Score",103.7600000,1.0000000,,,,1.2610000339919E-5,-0.1270000
TRNPETIKSVER,ac,K,42,true,"Quantitative Acetylproteomics",101,29440448,,,,,,,,
NPETIKSVER,ub,K,42,true,"Arabidopsis ubiquitination COFRADIC",40,26744219,"MaxQuant Score",111.2700000,1.0000000,,,,3.4419999061313E-33,0.1340000
TRNPETIKSVER,ph,S,43,true,"Phospho cell culture sucrose/TOR",109,30833711,,,0.9995100,,,,,
NPETIKSVER,ph,S,43,true,"Tissue atlas Arabidopsis - ProteomicsDB",114,32188942,"MaxQuant score",141.5400000,0.9999840,,,,4.5612600843015E-6,
KLMEKGVQR,ub,K,47,true,"Arabidopsis ubiquitination COFRADIC",40,26744219,"MaxQuant Score",130.4100000,1.0000000,,,,0.0001062000010279,-0.9250000
KLMEKGVQR,ub,K,51,true,"Arabidopsis ubiquitination COFRADIC",40,26744219,"MaxQuant Score",130.4100000,1.0000000,,,,0.0001062000010279,-0.9250000
MDRHPSDGIPLR,ph,S,61,true,"Phospho cell culture sucrose/TOR",109,30833711,,,1.0000000,,,,,
MDRHPSDGIPLR,ph,S,61,true,"Tissue atlas Arabidopsis - ProteomicsDB",114,32188942,"MaxQuant score",112.9500000,1.0000000,,,,3.3552500099177E-5,
SGDDVAVELVK,ph,S,114,true,"Tissue atlas Arabidopsis - ProteomicsDB",114,32188942,"MaxQuant score",142.5100000,1.0000000,,,,5.1318398419653E-8,
