Peptide,PTM,ModifiedAA,ModifiedPosition,PeptideUniqueToGene,ExperimentDesc,ExpID,PubmedID,ScoreType,IdentScore,LocProb,Log2FChange,PQ-val,QuantSig,PEP,MassErrorPPM
GAVSFAER,ph,S,11,true,"atm and atr DNA damage response",88,25561503,"MASCOT Score",69.0000000,1.0000000,,,,,0.0200000
GAVSFAER,ph,S,11,true,"TOR Kinase and ABA Receptor",100,29290610,XCorr,3.0411613,1.0000000,,,,0.0056130001321435,
GAVSFAER,ph,S,11,true,"Tissue atlas Arabidopsis - ProteomicsDB",114,32188942,"MaxQuant score",107.7900000,1.0000000,,,,0.0048023499548435,
TKSVDALTKK,ph,S,18,true,"Tissue atlas Arabidopsis - ProteomicsDB",114,32188942,"MaxQuant score",99.1610000,0.9942400,,,,0.0004590000025928,
TKSVDALTK,ph,S,18,true,"atm and atr DNA damage response",88,25561503,"MASCOT Score",32.0000000,1.0000000,,,,,-1.6700000
EILSALNSGEVSETSEDAR,ph,S,33,true,"Tissue atlas Arabidopsis - ProteomicsDB",114,32188942,"MaxQuant score",104.4500000,0.9938820,,,,1.7144300556993E-7,
GSLINLEQSR,ph,S,296,true,"atm and atr DNA damage response",88,25561503,"MASCOT Score",37.0000000,1.0000000,,,,,-0.2500000
GSLINLEQSR,ph,S,296,true,"Tissue atlas Arabidopsis - ProteomicsDB",114,32188942,"MaxQuant score",95.3460000,1.0000000,,,,0.00056387798395008,
