Peptide,PTM,ModifiedAA,ModifiedPosition,PeptideUniqueToGene,ExperimentDesc,ExpID,PubmedID,ScoreType,IdentScore,LocProb,Log2FChange,PQ-val,QuantSig,PEP,MassErrorPPM
ARSDYDYLIK,ph,S,10,false,"atm and atr DNA damage response",88,25561503,"MASCOT Score",31.0000000,0.9470000,,,,,-0.7900000
ARSDYDYLIK,ph,S,10,false,"Tissue atlas Arabidopsis - ProteomicsDB",114,32188942,"MaxQuant score",92.2950000,0.9988800,,,,0.0017996799433604,
SCLLLR,sno,C,30,false,"hot5-4 / wildtype, FAT-switch S-nitrosoproteome",169,37277371,,,,,,,,
SCLLLR,so,C,30,false,"S-sulfenylation site detection using YAP1C",110,32714340,,,,,,,,
TVELDGKR,ac,K,62,false,"Quantitative Acetylproteomics",101,29440448,,,,,,,,
IKLQIWDTAGQER,ub,K,65,false,"upl3 mutant / wildtype",168,35926874,"MaxQuant score",66.9890000,1.0000000,0.1335635,,,0.00041832000715658,-0.2893100
FRTITTAYYR,ph,T,79,false,"Tissue atlas Arabidopsis - ProteomicsDB",114,32188942,"MaxQuant score",74.7800000,0.9969940,,,,0.0043550902046263,
ILVGNKADMDESKR,ac,K,129,false,"Quantitative Acetylproteomics",101,29440448,,,,,,,,
ILVGNKADMDESK,ac,K,129,false,"Quantitative Acetylproteomics",101,29440448,,,,,,,,
ADMDESKR,ac,K,136,false,"Quantitative Acetylproteomics",101,29440448,,,,,,,,
ILVGNKADMDESKR,ub,K,136,false,"Ubiquitination Membrane Proteins",120,33585938,,,,,,,,
GQALADEYGIKFFETSAK,ub,K,154,false,"upl3 mutant / wildtype",168,35926874,"MaxQuant score",68.2430000,1.0000000,-0.1046974,0.8771800,NO,6.6752596467268E-5,0.7361700
TNQNVEQVFLSIAKDIK,ub,K,175,true,"upl3 mutant / wildtype",168,35926874,"MaxQuant score",152.3200000,1.0000000,-0.9573557,,,4.7850201444486E-17,0.6547000
AEPQGIKITK,ac,K,194,false,"Quantitative Acetylproteomics",101,29440448,,,,,,,,
