Peptide,PTM,ModifiedAA,ModifiedPosition,PeptideUniqueToGene,ExperimentDesc,ExpID,PubmedID,ScoreType,IdentScore,LocProb,Log2FChange,PQ-val,QuantSig,PEP,MassErrorPPM
DGNSAEIAQGQELSSPGR,ph,S,40,true,"Tissue atlas Arabidopsis - ProteomicsDB",114,32188942,"MaxQuant score",366.5200000,0.9678390,,,,0,
GLVLDLPSTTPEDTTR,ph,T,58,true,"Tissue atlas Arabidopsis - ProteomicsDB",114,32188942,"MaxQuant score",156.5000000,0.7585330,,,,3.7621999699616E-13,
RNASLTSSPVAK,ph,S,73,true,"atm and atr DNA damage response",88,25561503,"MASCOT Score",35.0000000,1.0000000,,,,,-0.6500000
NASLTSSPVAK,ph,S,73,true,"atm and atr DNA damage response",88,25561503,"MASCOT Score",63.0000000,1.0000000,,,,,0.4000000
NASLTSSPVAK,ph,S,73,true,"Tissue atlas Arabidopsis - ProteomicsDB",114,32188942,"MaxQuant score",190.5700000,1.0000000,,,,2.5434800879513E-18,
RNASLTSSPVAK,ph,T,75,true,"atm and atr DNA damage response",88,25561503,"MASCOT Score",35.0000000,0.9900000,,,,,-0.6500000
NASLTSSPVAK,ph,S,77,true,"atm and atr DNA damage response",88,25561503,"MASCOT Score",48.0000000,0.9980000,,,,,-0.7600000
NASLTSSPVAK,ph,S,77,true,"Tissue atlas Arabidopsis - ProteomicsDB",114,32188942,"MaxQuant score",190.5700000,0.9699320,,,,2.5434800879513E-18,
RVNFSPMSSPR,ph,S,86,true,"atm and atr DNA damage response",88,25561503,"MASCOT Score",23.0000000,1.0000000,,,,,0.2900000
RVNFSPMSSPR,ph,S,86,true,"Tissue atlas Arabidopsis - ProteomicsDB",114,32188942,"MaxQuant score",136.2400000,1.0000000,,,,1.4691499927721E-6,
RVNFSPMSSPR,ph,S,89,true,"Tissue atlas Arabidopsis - ProteomicsDB",114,32188942,"MaxQuant score",91.9370000,0.8195770,,,,0.00023330199474003,
RVNFSPMSSPR,ph,S,90,true,"atm and atr DNA damage response",88,25561503,"MASCOT Score",23.0000000,0.9890000,,,,,0.2900000
RVNFSPMSSPR,ph,S,90,true,"Tissue atlas Arabidopsis - ProteomicsDB",114,32188942,"MaxQuant score",136.2400000,0.9791490,,,,1.4691499927721E-6,
GASLSPSSSTSSSSR,ph,S,99,true,"atm and atr DNA damage response",88,25561503,"MASCOT Score",79.0000000,0.9940000,,,,,-0.3400000
GASLSPSSSTSSSSR,ph,S,99,true,"Tissue atlas Arabidopsis - ProteomicsDB",114,32188942,"MaxQuant score",77.3240000,0.9999930,,,,0.00024823099374771,
GASLSPSSSTSSSSR,ph,S,101,true,"atm and atr DNA damage response",88,25561503,"MASCOT Score",79.0000000,0.9820000,,,,,-0.3400000
GASLSPSSSTSSSSR,ph,S,101,true,"Tissue atlas Arabidopsis - ProteomicsDB",114,32188942,"MaxQuant score",192.3200000,0.9999880,,,,3.9505398844611E-34,
NLIPKLSFK,ph,S,125,true,"Tissue atlas Arabidopsis - ProteomicsDB",114,32188942,"MaxQuant score",111.2600000,1.0000000,,,,0.00071639800444245,
AADLGFVSSPSSGNGR,ph,S,149,true,"atm and atr DNA damage response",88,25561503,"MASCOT Score",63.0000000,0.8850000,,,,,-0.0900000
AADLGFVSSPSSGNGR,ph,S,149,true,"Tissue atlas Arabidopsis - ProteomicsDB",114,32188942,"MaxQuant score",199.1500000,0.9657160,,,,3.8744599443113E-36,
AADLGFVSSPSSGNGR,ph,S,152,true,"atm and atr DNA damage response",88,25561503,"MASCOT Score",36.0000000,0.9430000,,,,,0.3700000
KTESLPVTPIAHSNPESTHGR,ph,T,174,true,"Tissue atlas Arabidopsis - ProteomicsDB",114,32188942,"MaxQuant score",132.2800000,0.9468540,,,,1.709979957892E-22,
KTESLPVTPIAHSNPESTHGR,ph,S,176,true,"TOR Kinase and ABA Receptor",100,29290610,XCorr,3.8826621,0.8768000,,,,1.6239999922618E-6,
TESLPVTPIAHSNPESTHGR,ph,S,176,true,"Tissue atlas Arabidopsis - ProteomicsDB",114,32188942,"MaxQuant score",115.8700000,0.9987000,,,,5.8585997381524E-13,
KTESLPVTPIAHSNPESTHGR,ph,T,180,true,"Tissue atlas Arabidopsis - ProteomicsDB",114,32188942,"MaxQuant score",114.3100000,0.9999500,,,,7.9769199058666E-13,
SRSVPAFNK,ph,S,215,true,"atm and atr DNA damage response",88,25561503,"MASCOT Score",35.0000000,1.0000000,,,,,-1.8900000
SVPAFNK,ph,S,215,true,"Tissue atlas Arabidopsis - ProteomicsDB",114,32188942,"MaxQuant score",140.6300000,1.0000000,,,,0.0001579119998496,
VIPTPNMSPTR,ph,T,236,true,"atm and atr DNA damage response",88,25561503,"MASCOT Score",28.0000000,1.0000000,,,,,-1.6800000
VIPTPNMSPTR,ph,S,240,true,"atm and atr DNA damage response",88,25561503,"MASCOT Score",37.0000000,0.9920000,,,,,-0.2200000
VIPTPNMSPTR,ph,S,240,true,"Tissue atlas Arabidopsis - ProteomicsDB",114,32188942,"MaxQuant score",120.8400000,0.9469050,,,,1.7102500351029E-5,
VIPTPNMSPTR,ph,T,242,true,"atm and atr DNA damage response",88,25561503,"MASCOT Score",28.0000000,0.9630000,,,,,-1.6800000
