Peptide,PTM,ModifiedAA,ModifiedPosition,PeptideUniqueToGene,ExperimentDesc,ExpID,PubmedID,ScoreType,IdentScore,LocProb,Log2FChange,PQ-val,QuantSig,PEP,MassErrorPPM
AFSPDSKK,ph,S,16,false,"atm and atr DNA damage response",88,25561503,"MASCOT Score",37.0000000,1.0000000,,,,,-2.5100000
KAFSPDSK,ph,S,16,false,"atm and atr DNA damage response",88,25561503,"MASCOT Score",30.0000000,0.9370000,,,,,-3.4800000
LKHESVECQDSVISYPVLIATSR,ph,T,42,true,"Tissue atlas Arabidopsis - ProteomicsDB",114,32188942,"MaxQuant score",229.9700000,0.7918650,,,,0,
HESVECQDSVISYPVLIATSR,ph,T,42,true,"Large-scale phosphorylation discovery",44,23111157,XCorr,4.0800000,,,,,,
HESVECQDSVISYPVLIATSR,ph,S,43,true,"Tissue atlas Arabidopsis - ProteomicsDB",114,32188942,"MaxQuant score",240.7100000,0.8279730,,,,0,
SSSPQFEVR,ph,S,47,true,"srk2dei ABA signaling phopshoproteomics",83,23572148,"MASCOT Score",35.0000000,,,,,,-0.0004000
SSSPQFEVR,ph,S,47,true,"atm and atr DNA damage response",88,25561503,"MASCOT Score",40.0000000,0.9550000,,,,,0.3200000
SSSPQFEVR,ph,S,47,true,"Tissue atlas Arabidopsis - ProteomicsDB",114,32188942,"MaxQuant score",152.5400000,0.9999960,,,,8.5571999079548E-5,
ALAYAFTHQQNLKSFSK,ph,S,241,true,"Tissue atlas Arabidopsis - ProteomicsDB",114,32188942,"MaxQuant score",84.7620000,0.8630660,,,,4.5371700252872E-5,
PWESSEKEQNTTNNDNSSVKNSTNR,ng,N,280,true,"ER-associatied N-glycan degradation chilling stres",133,27558752,,,,,,,,
EQNTTNNDNSSVK,ph,S,288,true,"atm and atr DNA damage response",88,25561503,"MASCOT Score",60.0000000,0.9960000,,,,,0.2000000
LNSSTKPNTPSASSTATR,ph,T,319,true,"Tissue atlas Arabidopsis - ProteomicsDB",114,32188942,"MaxQuant score",78.0980000,0.9810310,,,,0.00011726299999282,
SKSSDDEAK,ph,S,345,true,"atm and atr DNA damage response",88,25561503,"MASCOT Score",27.0000000,0.9620000,,,,,-3.0200000
SSDDEAKSSER,ph,S,351,true,"atm and atr DNA damage response",88,25561503,"MASCOT Score",33.0000000,0.9270000,,,,,1.9600000
RPSIARPSVSDDETLSSSTAR,ph,S,366,true,"TOR Kinase and ABA Receptor",100,29290610,XCorr,3.1378617,0.8804000,,,,0.010180000215769,
PSVSDDETLSSSTAR,ph,S,366,true,"atm and atr DNA damage response",88,25561503,"MASCOT Score",71.0000000,1.0000000,,,,,-0.3200000
PSVSDDETLSSSTAR,ph,S,366,true,"Tissue atlas Arabidopsis - ProteomicsDB",114,32188942,"MaxQuant score",248.6700000,0.9999990,,,,0,
LSTSASPAPKPR,ph,S,429,true,"atm and atr DNA damage response",88,25561503,"MASCOT Score",36.0000000,1.0000000,,,,,-3.2600000
LSTSASPAPKPR,ph,S,429,true,"Tissue atlas Arabidopsis - ProteomicsDB",114,32188942,"MaxQuant score",82.5150000,0.9935540,,,,0.00049142597708851,
