Peptide,PTM,ModifiedAA,ModifiedPosition,PeptideUniqueToGene,ExperimentDesc,ExpID,PubmedID,ScoreType,IdentScore,LocProb,Log2FChange,PQ-val,QuantSig,PEP,MassErrorPPM
DGPVCPPSNKLSRASFPE,nt,D,25,true,"N-terminal ChaFRADIC",92,26010716,"MASCOT Score",37.6400000,,,,,4.0759999819784E-7,
DGPVCPPSNKLSRASFPE,nt,D,25,true,"Arg/N-end rule seed, prt6 vs. Wt",99,29168982,"MASCOT Score",22.2900000,,-0.0196270,0.9004784,NO,0.0040090000256896,-1.7878025
DGPVCPPSNKLSR,nt,D,25,true,"Metacaspase9 substrates - 35S:MC9 / mc9",51b,23964026,"MASCOT Score",46.0000000,,1.4149507,,NO,,-1.8426540
DGPVCPPSNKLSR,nt,D,25,true,"Arg/N-end rule pathway Roots",80,25728785,"MASCOT Score",57.4600000,,,,,0.0027580000460148,
DGPVCPPSNKLSR,nt,D,25,true,"N-terminal ChaFRADIC",92,26010716,"MASCOT Score",31.1100000,,,,,1.2210000477353E-6,
DGPVCPPSNKLSR,nt,D,25,true,"Arg/N-end rule seed, prt6 vs. Wt",99,29168982,"MASCOT Score",21.2200000,,-0.4806343,0.0078570,NO,0.0079250000417233,-1.3044360
DGPVCPPSNKLSR,nt,D,25,true,"FtsH12 N-terminome: WT / FtsH12 knockdown miRNA",118,33216923,"MaxQuant score",66.0560000,,,,,0.02182799950242,
DGPVCPPSNKL,nt,D,25,true,"N-terminal ChaFRADIC",92,26010716,"MASCOT Score",28.9200000,,,,,0.00070139998570085,
GTATAAYQVE,nt,G,47,false,"Arg/N-end rule seed, prt6 vs. Wt",99,29168982,"MASCOT Score",35.7600000,,,,,0.049699999392033,-1.1735999
TATAAYQVE,nt,T,48,false,"Arg/N-end rule seed, prt6 vs. Wt",99,29168982,"MASCOT Score",57.1900000,,,,,0.0038469999562949,-0.9326805
ATAAYQVE,nt,A,49,false,"Arg/N-end rule seed, prt6 vs. Wt",99,29168982,"MASCOT Score",42.2300000,,,,,0.0031850000377744,-0.1626665
LSRASFPEGFLFGTATAAYQVEGAINETCR,ng,N,60,true,"ER-associatied N-glycan degradation chilling stres",133,27558752,,,,,,,,
ASFPEGFLFGTATAAYQVEGAINETCR,ng,N,60,true,"Conserved N-glycosylation",74,22633491,"MaxQuant Score",224.8600000,1.0000000,,,,0,-0.8530000
CNNDNGDVAVDFFHR,sno,C,80,true,"hot5-4 / wildtype, FAT-switch S-nitrosoproteome",169,37277371,,,,,,,,
NNDNGDVAVDFFHR,nt,N,81,true,"Arg/N-end rule seed, prt6 vs. Wt",99,29168982,"MASCOT Score",80.6500000,,-0.3282235,0.0847698,NO,0.00018250000721309,-0.9842563
NDNGDVAVDFFHR,nt,N,82,true,"Arg/N-end rule seed, prt6 vs. Wt",99,29168982,"MASCOT Score",47.3800000,,-0.4676218,0.0210713,NO,0.0023040000814945,-0.7898381
DNGDVAVDFFHR,nt,D,83,true,"Arg/N-end rule seed, prt6 vs. Wt",99,29168982,"MASCOT Score",55.5100000,,-0.6457056,0.2494686,NO,0.0093400003388524,0.9005815
GDVAVDFFHR,nt,G,85,true,"Arg/N-end rule seed, prt6 vs. Wt",99,29168982,"MASCOT Score",47.5100000,,0.0636144,0.7577911,NO,0.062430001795292,-0.4679841
YKEDIQLMK,cr,K,96,false,"Open search Plant PTM Viewer 2.0 - Crotonylation",164c,TBA,,,,,,,,
YKEDIQLMKNLNTDAFR,ac,K,103,false,"Quantitative Acetylproteomics",101,29440448,,,,,,,,
YKEDIQLMK,ac,K,103,false,"Quantitative Acetylproteomics",101,29440448,,,,,,,,
TPQDLEDEYGGFLSER,nt,T,160,true,"Arg/N-end rule pathway Roots",80,25728785,"MASCOT Score",58.4400000,,,,,5.0829997988444E-9,
DLEDEYGGFLSER,nt,D,163,false,"Arg/N-end rule seed, prt6 vs. Wt",99,29168982,"MASCOT Score",31.3200000,,,,,0.02276000007987,-0.2254058
EYADFVFQEYGGKVK,hib,K,194,true,"Open search Plant PTM Viewer 2.0 - hib",164e,TBA,,,,,,,,
CSSYVNAK,sno,C,222,true,"hot5-4 / wildtype, FAT-switch S-nitrosoproteome",169,37277371,,,,-1.2340549,0.0069104,YES,,
CSSYVNAKCQDGR,pgk,K,229,true,"Open search Plant PTM Viewer 2.0 - 3pgK",164f,TBA,,,,,,,,
LVTHNLLISHAEAVEAYR,nt,L,241,true,"Arg/N-end rule pathway Roots",80,25728785,"MASCOT Score",36.2900000,,,,,1.0359999578213E-5,
NLLISHAE,nt,N,245,true,"Arg/N-end rule seed, prt6 vs. Wt",99,29168982,"MASCOT Score",44.9500000,,-0.9969339,0.0110774,NO,0.011719999834895,-0.4704920
NLLISHAEAVEAYR,nta,N,245,true,"FtsH12 N-terminome: WT / FtsH12 knockdown miRNA",118,33216923,"MaxQuant score",126.1000000,,,,,4.3899999767494E-16,
ISHAEAVEAYR,nt,I,248,true,"FtsH12 N-terminome: WT / FtsH12 knockdown miRNA",118,33216923,"MaxQuant score",105.6500000,,,,,2.9100000187299E-9,
AEAVEAYR,nt,A,251,true,"Metacaspase9 substrates - 35S:MC9 / mc9",51b,23964026,"MASCOT Score",51.0000000,,1.1957134,,NO,,-0.4075413
AEAVEAYR,nt,A,251,true,"Arg/N-end rule seed, prt6 vs. Wt",99,29168982,"MASCOT Score",34.8900000,,-0.8991354,0.0119067,NO,0.075879998505116,0.7174797
EAVEAYR,nt,E,252,true,"Arg/N-end rule seed, prt6 vs. Wt",99,29168982,"MASCOT Score",38.6300000,,-0.2747069,0.1124149,NO,0.20039999485016,0.2029736
DLADSQDGASIDR,nt,D,281,true,"Arg/N-end rule seed, prt6 vs. Wt",99,29168982,"MASCOT Score",65.1900000,,-1.6340567,0.1067175,NO,0.002297000028193,0.2903551
DLADSQDGASIDR,nta,D,281,true,"FtsH12 N-terminome: WT / FtsH12 knockdown miRNA",118,33216923,"MaxQuant score",188.8100000,,,,,0,
LADSQDGASIDR,nt,L,282,true,"Arg/N-end rule pathway Roots",80,25728785,"MASCOT Score",39.9600000,,,,,0.049059998244047,
ADSQDGASIDR,nt,A,283,true,"Arg/N-end rule seed, prt6 vs. Wt",99,29168982,"MASCOT Score",25.0800000,,-0.2157854,0.4409982,NO,0.20579999685287,1.4655750
DSQDGASIDR,nt,D,284,true,"Arg/N-end rule seed, prt6 vs. Wt",99,29168982,"MASCOT Score",74.1000000,,0.2615036,0.7133307,NO,0.0010110000148416,-1.2787359
LPKFTTEQK,ac,K,325,true,"Quantitative Acetylproteomics",101,29440448,,,,,,,,
FTTEQKAK,ac,K,331,true,"Quantitative Acetylproteomics",101,29440448,,,,,,,,
YYTSVFSNHLE,nt,Y,345,true,"Arg/N-end rule seed, prt6 vs. Wt",99,29168982,"MASCOT Score",28.1700000,,-0.9524124,0.0099257,NO,9.1770001745317E-5,-1.8640452
TSVFSNHLE,nt,T,347,true,"Arg/N-end rule seed, prt6 vs. Wt",99,29168982,"MASCOT Score",38.9500000,,-0.8362419,0.0652467,NO,0.0020369999110699,-0.9499735
SKNAQNYAIG,nt,S,374,true,"Arg/N-end rule seed, prt6 vs. Wt",99,29168982,"MASCOT Score",34.2400000,,-0.5768873,0.0872526,NO,0.00079129997175187,0.0628255
NAQNYAIGSKPLTAALNVYSR,ph,S,384,true,"Tissue atlas Arabidopsis - ProteomicsDB",114,32188942,"MaxQuant score",190.1900000,0.9992220,,,,0,
SLLKYIK,ac,K,403,false,"Quantitative Acetylproteomics",101,29440448,,,,,,,,
GYGEELGASDSVAVGTADHNR,nt,G,420,true,"Arg/N-end rule seed, prt6 vs. Wt",99,29168982,"MASCOT Score",47.3200000,,-0.5212600,0.3038769,NO,0.00015720000374131,-0.3057850
SDSVAVGTADHNR,nt,S,428,true,"FtsH12 N-terminome: WT / FtsH12 knockdown miRNA",118,33216923,"MaxQuant score",86.2480000,,,,,5.4699998599649E-14,
SVAVGTADHNR,nt,S,430,true,"Tic56 chloroplast import - wild-type",89a,25588737,XCorr,2.6620672,,,,,,
SVAVGTADHNR,nt,S,430,true,"Arg/N-end rule seed, prt6 vs. Wt",99,29168982,"MASCOT Score",60.0500000,,-0.6556496,0.0468331,NO,0.010719999670982,-0.9518881
HLLSMQEAVCIDK,sno,C,456,true,"hot5-4 / wildtype, FAT-switch S-nitrosoproteome",169,37277371,,,,,,,,
VNVTGYFVWSLLDNFEWQDGYK,ng,N,461,true,"ER-associatied N-glycan degradation chilling stres",133,27558752,,,,,,,,
FGLYYVDFKNNLTRYEK,ng,N,494,false,"N-glycan occupancy Arabidopsis glycoproteins",87,23994444,"Ladder score",56.6000000,,,,,,
FGLYYVDFKNNLTR,ng,N,494,false,"Conserved N-glycosylation",74,22633491,"MaxQuant Score",136.7800000,0.9330000,,,,1.2949999750597E-19,-0.8780000
FGLYYVDFKNNLTR,ng,N,494,false,"N-glycan occupancy Arabidopsis glycoproteins",87,23994444,"Ladder score",85.2000000,,,,,,
YVDFKNNLTRYEK,ng,N,494,false,"N-glycan occupancy Arabidopsis glycoproteins",87,23994444,"Ladder score",60.0000000,,,,,,
VDFKNNLTRYEK,ng,N,494,false,"N-glycan occupancy Arabidopsis glycoproteins",87,23994444,"Ladder score",60.9000000,,,,,,
YVDFKNNLTR,ng,N,494,false,"N-glycan occupancy Arabidopsis glycoproteins",87,23994444,"Ladder score",71.9000000,,,,,,
VDFKNNLTR,ng,N,494,false,"N-glycan occupancy Arabidopsis glycoproteins",87,23994444,"Ladder score",62.7000000,,,,,,
NNLTRYEK,ng,N,494,false,"N-glycan occupancy Arabidopsis glycoproteins",87,23994444,"Ladder score",82.2000000,,,,,,
NNLTR,ng,N,494,false,"ER-associatied N-glycan degradation chilling stres",133,27558752,,,,,,,,
YYKDFLSQGVRPSALK,ac,K,507,true,"Quantitative Acetylproteomics",101,29440448,,,,,,,,
DFLSQGVRPSALK,ph,S,517,true,"Tissue atlas Arabidopsis - ProteomicsDB",114,32188942,"MaxQuant score",60.7340000,0.9971270,,,,0.0018300299998373,
DFLSQGVRPSALKK,ac,K,520,true,"Quantitative Acetylproteomics",101,29440448,,,,,,,,
DFLSQGVRPSALK,ac,K,520,true,"Quantitative Acetylproteomics",101,29440448,,,,,,,,
