Peptide,PTM,ModifiedAA,ModifiedPosition,PeptideUniqueToGene,ExperimentDesc,ExpID,PubmedID,ScoreType,IdentScore,LocProb,Log2FChange,PQ-val,QuantSig,PEP,MassErrorPPM
TKSFSASK,ph,S,113,false,"atm and atr DNA damage response",88,25561503,"MASCOT Score",37.0000000,0.9910000,,,,,-1.0300000
NNEGFSGVFEPQRR,ph,S,124,true,"Tissue atlas Arabidopsis - ProteomicsDB",114,32188942,"MaxQuant score",141.0000000,1.0000000,,,,7.2795201049303E-6,
NNEGFSGVFEPQR,ph,S,124,true,"Phosphorylation Early Elicitor Signaling",23,17317660,,,,,,,,
EKSDEIVEVR,nta,E,218,true,"Arg/N-end rule pathway Roots",80,25728785,"MASCOT Score",38.2400000,,,,,0.16459999978542,
EKSDEIVEVR,ub,K,219,true,"Arabidopsis ubiquitination COFRADIC",40,26744219,"MaxQuant Score",55.3530000,1.0000000,,,,0.0020000000949949,0.0170000
EKSDEIVEVR,ph,S,220,true,"atm and atr DNA damage response",88,25561503,"MASCOT Score",41.0000000,1.0000000,,,,,-1.0000000
EKSDEIVEVR,ph,S,220,true,"Tissue atlas Arabidopsis - ProteomicsDB",114,32188942,"MaxQuant score",169.1400000,1.0000000,,,,3.7653600770682E-7,
GLSEEELKPIKDYIDLDSQTK,ph,S,241,true,"Col-0 callus - FC Col-0 vs. Col-0 Xray",111a,31410901,,45.7400000,,0.7592515,0.0000000,NO,,0.7258903
GLSEEELKPIKDYIDLDSQTK,ph,S,241,true,"Col-0 X-ray callus - FC Col-0 vs. Col-0 Xray",111b,31410901,,45.7400000,,0.7592515,0.0000000,NO,,0.7258903
GLSEEELKPIKDYIDLDSQTK,ph,S,241,true,"atm callus - FC atm vs. atm Xray",111c,31410901,,45.7400000,,0.4552361,0.0000000,NO,,0.7258903
GLSEEELKPIKDYIDLDSQTK,ph,S,241,true,"atm-3 X-ray callus - FC atm vs. atm Xray",111d,31410901,,45.7400000,,0.4552361,0.0000000,NO,,0.7258903
GLSEEELKPIKDYIDLDSQTK,ph,S,241,true,"Tissue atlas Arabidopsis - ProteomicsDB",114,32188942,"MaxQuant score",244.3000000,1.0000000,,,,0,
GLSEEELKPIK,ph,S,241,true,"Tyrosine phosphorylation in Arabidopsis",59,18463617,"MASCOT Score",38.0000000,,,,,,-0.5296401
GLSEEELKPIK,ph,S,241,true,"atm and atr DNA damage response",88,25561503,"MASCOT Score",29.0000000,1.0000000,,,,,-2.4700000
GLSEEELKPIK,ph,S,241,true,"TOR Kinase and ABA Receptor",100,29290610,XCorr,2.4880917,1.0000000,,,,0.0056269997730851,
GLSEEELKPIK,ph,S,241,true,"Phospho cell culture sucrose/TOR",109,30833711,,,1.0000000,,,,,
NGGDHRPGSAR,ph,S,300,true,"atm and atr DNA damage response",88,25561503,"MASCOT Score",29.0000000,1.0000000,,,,,-0.2100000
DTQSEIADYGYGR,ph,S,318,true,"Phosphorylation nuclei-enriched fractions",28,19245862,,,,,,,,
DTQSEIADYGYGR,ph,S,318,true,"Tyrosine phosphorylation in Arabidopsis",59,18463617,"MASCOT Score",63.0000000,,,,,,-0.7723985
DTQSEIADYGYGR,ph,S,318,true,"atm and atr DNA damage response",88,25561503,"MASCOT Score",65.0000000,1.0000000,,,,,-0.0600000
DTQSEIADYGYGR,ph,S,318,true,"Phospho cell culture sucrose/TOR",109,30833711,,,1.0000000,,,,,
DTQSEIADYGYGR,ph,S,318,true,"Col-0 callus - FC Col-0 vs. Col-0 Xray",111a,31410901,,67.7100000,,1.2908136,0.0000000,NO,,0.9606235
DTQSEIADYGYGR,ph,S,318,true,"Col-0 X-ray callus - FC Col-0 vs. Col-0 Xray",111b,31410901,,67.7100000,,1.2908136,0.0000000,NO,,0.9606235
DTQSEIADYGYGR,ph,S,318,true,"atm callus - FC atm vs. atm Xray",111c,31410901,,67.7100000,,0.3549117,0.0000000,NO,,0.9606235
DTQSEIADYGYGR,ph,S,318,true,"atm-3 X-ray callus - FC atm vs. atm Xray",111d,31410901,,67.7100000,,0.3549117,0.0000000,NO,,0.9606235
DTQSEIADYGYGR,ph,S,318,true,"Tissue atlas Arabidopsis - ProteomicsDB",114,32188942,"MaxQuant score",297.5100000,1.0000000,,,,0,
ISLDDPR,ph,S,358,true,"Tissue atlas Arabidopsis - ProteomicsDB",114,32188942,"MaxQuant score",92.4740000,1.0000000,,,,0.00012050900113536,
ISLDDPRYSFDEPR,ph,S,365,true,"Tissue atlas Arabidopsis - ProteomicsDB",114,32188942,"MaxQuant score",157.5800000,0.9999980,,,,3.6556799254406E-10,
ASWDGSLIGR,ph,S,372,true,"atm and atr DNA damage response",88,25561503,"MASCOT Score",45.0000000,1.0000000,,,,,0.3800000
ASWDGSLIGR,ph,S,372,true,"Tissue atlas Arabidopsis - ProteomicsDB",114,32188942,"MaxQuant score",132.8500000,1.0000000,,,,5.2560699259629E-7,
DNNNYAVETADNGSFREPAMMIGDR,ph,S,516,true,"Tissue atlas Arabidopsis - ProteomicsDB",114,32188942,"MaxQuant score",287.2000000,1.0000000,,,,0,
SLSESWPELR,ph,S,582,true,"Phospho cell culture sucrose/TOR",109,30833711,,,0.9991700,,,,,
SLSESWPELR,ph,S,582,true,"Tissue atlas Arabidopsis - ProteomicsDB",114,32188942,"MaxQuant score",209.8500000,0.9999990,,,,7.7945002938673E-20,
SLSESWPELR,ph,S,584,true,"Tissue atlas Arabidopsis - ProteomicsDB",114,32188942,"MaxQuant score",105.2000000,0.9989510,,,,0.00028703000862151,
SNSNVSWR,ph,S,605,false,"atm and atr DNA damage response",88,25561503,"MASCOT Score",48.0000000,0.9960000,,,,,-0.1300000
SNSNVSWR,ph,S,605,false,"TOR Kinase and ABA Receptor",100,29290610,XCorr,3.3467731,0.9990000,,,,0.00026470000739209,
SNSNVSWR,ph,S,605,false,"Tissue atlas Arabidopsis - ProteomicsDB",114,32188942,"MaxQuant score",158.9400000,0.9999920,,,,0.0012559100287035,
SNSNVSWR,ph,S,608,false,"Tissue atlas Arabidopsis - ProteomicsDB",114,32188942,"MaxQuant score",67.5480000,0.9999990,,,,0.0099111897870898,
MSGTGGAGGGGGGGWANSHGHSIAR,ph,S,676,true,"Tissue atlas Arabidopsis - ProteomicsDB",114,32188942,"MaxQuant score",181.5800000,0.9948080,,,,0,
