Peptide,PTM,ModifiedAA,ModifiedPosition,PeptideUniqueToGene,ExperimentDesc,ExpID,PubmedID,ScoreType,IdentScore,LocProb,Log2FChange,PQ-val,QuantSig,PEP,MassErrorPPM
ASCISFKDSACR,ox,C,81,false,"OxiTRAQ SA and flg22 responses - SA vs mock",91a,25720653,"MASCOT Score",20.3600000,,-0.5777670,0.1010000,NO,,
ASCISFKDSACR,ox,C,81,false,"OxiTRAQ SA and flg22 responses - flg22 vs mock",91b,25720653,"MASCOT Score",20.3600000,,-0.7612131,0.0200000,YES,,
ASCISFK,ox,C,81,false,"OxiTRAQ Arabidopsis - 5 mM H2O2 versus control",47,24376095,,,,-0.1285249,0.1743449,NO,,
ASCISFK,sno,C,81,false,"hot5-4 / wildtype, FAT-switch S-nitrosoproteome",169,37277371,,,,,,,,
ASCISFK,so,C,81,false,"S-sulfenylation site detection using YAP1C",110,32714340,,,,,,,,
ASCISFKDSACR,ac,K,85,false,"Histone deacetylases substrates - TSA vs control",98b,29061669,"MaxQuant Score",69.0000000,1.0000000,0.0970000,0.9977001,NO,0.0010000000474975,
ASCISFKDSACR,hib,K,85,false,"Open search Plant PTM Viewer 2.0 - hib",164e,TBA,,,,,,,,
CFGYMVSK,acy,C,91,false,"Arabidopsis S-acylation atlas - Meristem",163a,35681017,,,,,,,,
CFGYMVSK,acy,C,91,false,"Arabidopsis S-acylation atlas - Hypocotyl",163b,35681017,,,,,,,,
CFGYMVSK,ox,C,91,false,"OxiTRAQ Arabidopsis - 5 mM H2O2 versus control",47,24376095,,,,-0.0304230,0.3116562,NO,,
CFGYMVSK,ox,C,91,false,"OxiTRAQ SA and flg22 responses - SA vs mock",91a,25720653,"MASCOT Score",41.3000000,,-0.6438562,0.0440000,YES,,
CFGYMVSK,ox,C,91,false,"OxiTRAQ SA and flg22 responses - flg22 vs mock",91b,25720653,"MASCOT Score",41.3000000,,-0.5353317,0.0380000,NO,,
CFGYMVSK,so,C,91,false,"S-sulfenylation site detection using YAP1C",110,32714340,,,,,,,,
ASNPFVNLK,ph,S,273,false,"atm and atr DNA damage response",88,25561503,"MASCOT Score",43.0000000,1.0000000,,,,,-1.1700000
ASNPFVNLKK,ac,K,280,false,"Quantitative Acetylproteomics",101,29440448,,,,,,,,
ASNPFVNLKK,ub,K,280,false,"upl3 mutant / wildtype",168,35926874,"MaxQuant score",67.3340000,1.0000000,-0.3997302,0.6737600,NO,0.0022453600540757,-0.1469200
