Peptide,PTM,ModifiedAA,ModifiedPosition,PeptideUniqueToGene,ExperimentDesc,ExpID,PubmedID,ScoreType,IdentScore,LocProb,Log2FChange,PQ-val,QuantSig,PEP,MassErrorPPM
AAANAPITMKEVL,nt,A,2,true,"Arg/N-end rule seed, prt6 vs. Wt",99,29168982,"MASCOT Score",40.9800000,,,,,0.026350000873208,-0.6576584
AAANAPITMKE,nt,A,2,true,"N-terminal ChaFRADIC",92,26010716,"MASCOT Score",52.7500000,,,,,0.042780000716448,
AAANAPITMKE,nt,A,2,true,"Stromal N-terminome",96,26371235,"MASCOT Score",43.9100000,,,,,,
AAANAPITMKE,nt,A,2,true,"Arg/N-end rule seed, prt6 vs. Wt",99,29168982,"MASCOT Score",54.3900000,,,,,2.262999987579E-5,-1.0046644
AAANAPITM,nt,A,2,true,"Arg/N-end rule seed, prt6 vs. Wt",99,29168982,"MASCOT Score",43.5600000,,,,,0.18639999628067,-0.5392367
AAANAPITMKEVL,nta,A,2,true,"Arg/N-end rule seed, prt6 vs. Wt",99,29168982,"MASCOT Score",40.9800000,,-0.6860064,0.0270620,NO,0.026350000873208,-0.6576584
AAANAPITMKEVL,nta,A,2,true,"Arabidopsis translation initiation landscape - NTA",167a,35069635,,,,,,,,
AAANAPITMKE,nta,A,2,true,"N-terminal ChaFRADIC",92,26010716,"MASCOT Score",52.7500000,,,,,0.042780000716448,
AAANAPITMKE,nta,A,2,true,"Stromal N-terminome",96,26371235,"MASCOT Score",43.9100000,,,,,,
AAANAPITMKE,nta,A,2,true,"Arg/N-end rule seed, prt6 vs. Wt",99,29168982,"MASCOT Score",54.3900000,,0.2754526,0.0779507,NO,2.262999987579E-5,-1.0046644
AAANAPITMKE,nta,A,2,true,"HUNTER N-terminome: legumain, GluC and trypsin",119,31951383,"MaxQuant score",98.2490000,,,,,,
AAANAPITMK,nta,A,2,true,"Characterization plant N-terminal acetylation",6,22223895,"MASCOT Score",84.1200000,,,,,,
AAANAPITM,nta,A,2,true,"Arg/N-end rule seed, prt6 vs. Wt",99,29168982,"MASCOT Score",43.5600000,,,,,0.18639999628067,-0.5392367
RPITADSALMNPNSK,ph,T,67,true,"atm and atr DNA damage response",88,25561503,"MASCOT Score",50.0000000,1.0000000,,,,,0.1600000
RPITADSALMNPNSK,ph,T,67,true,"Lateral root-induction - NAA vs control",106,23328941,"MASCOT Score",46.0000000,,,,,,
RPITADSALMNPNSK,ph,T,67,true,"Tissue atlas Arabidopsis - ProteomicsDB",114,32188942,"MaxQuant score",193.4800000,0.9999870,,,,8.1480897029384E-34,
RPITADSALMNPNSK,ph,S,70,true,"TOR Kinase and ABA Receptor",100,29290610,XCorr,3.3750384,0.9992000,,,,0.00075359997572377,
AQVPGTTQDHLQIFNIEAKAK,ac,K,102,false,"Quantitative Acetylproteomics",101,29440448,,,,,,,,
CSPNEK,so,C,164,false,"S-sulfenylation site detection using YAP1C",110,32714340,,,,,,,,
SVDQQRSQALE,nt,S,195,false,"Arg/N-end rule seed, prt6 vs. Wt",99,29168982,"MASCOT Score",20.4600000,,,,,0.024450000375509,-1.4224782
SQALEAH,nt,S,201,false,"Arg/N-end rule seed, prt6 vs. Wt",99,29168982,"MASCOT Score",46.6600000,,,,,0.1283999979496,-1.6400580
FQELFAQTKYK,ac,K,389,false,"Quantitative Acetylproteomics",101,29440448,,,,,,,,
GKLNSYESLELSR,nt,G,438,false,"Arabidopsis translation initiation landscape - NT",167b,35069635,,,,,,,,
GKLNSYESLELSR,ph,S,442,false,"Tissue atlas Arabidopsis - ProteomicsDB",114,32188942,"MaxQuant score",154.8100000,0.9999970,,,,1.4366400291621E-9,
LNSYESLELSR,ph,S,442,false,"SIRK1 phosphorylation",86a,23820729,"MaxQuant Score",74.4270000,0.9560000,,,,0.47799998521805,6.8270000
LNSYESLELSR,ph,S,442,false,"SIRK1 exp - sirk1 mutant vs WT",86b,23820729,,,,0.0040082,,NO,,
LNSYESLELSR,ph,S,442,false,"SIRK1 exp - 35S:SIRK1 vs WT",86c,23820729,,,,-2.0085851,,NO,,
LNSYESLELSR,ph,S,442,false,"atm and atr DNA damage response",88,25561503,"MASCOT Score",37.0000000,0.9470000,,,,,0.0000000
LNSYESLELSR,ph,S,442,false,"Phospho cell culture sucrose/TOR",109,30833711,,,0.9905290,,,,,
LNSYESLELSR,ph,S,445,false,"SIRK1 phosphorylation",86a,23820729,"MaxQuant Score",58.6810000,0.9240000,,,,0.87800002098083,-0.9650000
LNSYESLELSR,ph,S,445,false,"Tissue atlas Arabidopsis - ProteomicsDB",114,32188942,"MaxQuant score",97.9110000,0.9739550,,,,8.0680598330218E-5,
LNSYESLELSR,ph,S,449,false,"Tissue atlas Arabidopsis - ProteomicsDB",114,32188942,"MaxQuant score",97.9110000,0.9720270,,,,8.0680598330218E-5,
NLLENWLAEDKLECSEELGDLVK,so,C,472,false,"S-sulfenylation site detection using YAP1C",110,32714340,,,,,,,,
LECSEELGDLVK,so,C,472,false,"Arabidopsis S-sulfenylation chemoproteomics",108,31578252,"pFind PSM Score",0.0002025,,2.1780300,,,,-0.5094761
TVDNDLALK,ac,K,490,false,"Quantitative Acetylproteomics",101,29440448,,,,,,,,
IAQLCEK,sno,C,631,true,"hot5-4 / wildtype, FAT-switch S-nitrosoproteome",169,37277371,,,,0.0166055,0.9724875,NO,,
HYSELPDIKR,ac,K,651,false,"Quantitative Acetylproteomics",101,29440448,,,,,,,,
EYCEQLGVDACIK,sno,C,712,false,"hot5-4 / wildtype, FAT-switch S-nitrosoproteome",169,37277371,,,,,,,,
YIEAAAKTGQIK,ac,K,751,false,"Quantitative Acetylproteomics",101,29440448,,,,,,,,
TGQIKEVER,ac,K,756,false,"Quantitative Acetylproteomics",101,29440448,,,,,,,,
PLINVCDR,so,C,792,false,"Arabidopsis S-sulfenylation chemoproteomics",108,31578252,"pFind PSM Score",0.0099912,,,,,,-0.9965740
PLINVCDR,so,C,792,false,"S-sulfenylation site detection using YAP1C",110,32714340,,,,,,,,
VNPGNAPLVVGQLLDDECPEDFIK,sno,C,838,false,"hot5-4 / wildtype, FAT-switch S-nitrosoproteome",169,37277371,,,,,,,,
VNPGNAPLVVGQLLDDECPEDFIK,so,C,838,false,"S-sulfenylation site detection using YAP1C",110,32714340,,,,,,,,
SLLPVEPLVEECEKR,sno,C,863,true,"Site-specific nitrosomeproteomic id - gsnor1-3",90a,25699590,XCorr,2.7411752,,,,,0.023399999365211,-5.6692860
SLLPVEPLVEECEKR,sno,C,863,true,"Site-specific nitrosomeproteomic id - gsnor1-3",90b,25699590,XCorr,2.0700000,,,,,0.20239999890327,-7.2300000
SLLPVEPLVEECEKR,sno,C,863,true,"hot5-4 / wildtype, FAT-switch S-nitrosoproteome",169,37277371,,,,,,,,
SLLPVEPLVEECEK,sno,C,863,true,"Site-specific nitrosomeproteomic id - gsnor1-3",90a,25699590,XCorr,2.4464836,,,,,0.0027050001081079,-5.9015973
SLLPVEPLVEECEK,sno,C,863,true,"Site-specific nitrosomeproteomic id - gsnor1-3",90b,25699590,XCorr,2.0700000,,,,,0.14040000736713,-7.4600000
SLLPVEPLVEECEK,sno,C,863,true,"hot5-4 / wildtype, FAT-switch S-nitrosoproteome",169,37277371,,,,0.6436938,0.0302651,YES,,
SLLPVEPLVEECEKR,so,C,863,true,"Arabidopsis S-sulfenylation chemoproteomics",108,31578252,"pFind PSM Score",0.2056760,,0.8620700,,,,-0.7657953
YCEKRDPTLAVVAYR,ub,K,925,false,"upl3 mutant / wildtype",168,35926874,"MaxQuant score",84.7530000,1.0000000,-0.1456053,0.7908600,NO,1.1158599590999E-5,-0.2510900
RGQCDEELINVTNK,sno,C,940,false,"Site-specific nitrosomeproteomic id - gsnor1-3",90a,25699590,XCorr,3.9460034,,,,,0.0073270001448691,-6.2617219
RGQCDEELINVTNK,sno,C,940,false,"Site-specific nitrosomeproteomic id - gsnor1-3",90b,25699590,XCorr,3.4000000,,,,,0.032790001481771,-7.1200000
GQCDEELINVTNK,sno,C,940,false,"Site-specific nitrosomeproteomic id - gsnor1-3",90a,25699590,XCorr,3.6115160,,,,,2.7769999633165E-6,-6.6209613
GQCDEELINVTNK,sno,C,940,false,"Site-specific nitrosomeproteomic id - gsnor1-3",90b,25699590,XCorr,3.6000000,,,,,0.000129799998831,-7.0700000
RGQCDEELINVTNK,so,C,940,false,"S-sulfenylation site detection using YAP1C",110,32714340,,,,,,,,
GQCDEELINVTNK,so,C,940,false,"Arabidopsis S-sulfenylation chemoproteomics",108,31578252,"pFind PSM Score",0.3428310,,,,,,-0.0206695
NFDGPAVGE,nt,N,1063,false,"Arg/N-end rule seed, prt6 vs. Wt",99,29168982,"MASCOT Score",47.0600000,,,,,0.0023240000009537,-1.6222529
ADDATHFLEVIR,ph,T,1149,true,"Tissue atlas Arabidopsis - ProteomicsDB",114,32188942,"MaxQuant score",122.9700000,1.0000000,,,,1.5298599464586E-5,
VKEPKVDSELIYAYAK,ub,K,1182,false,"upl3 mutant / wildtype",168,35926874,"MaxQuant score",49.5950000,0.9880000,,,,0.0024956299457699,2.0111000
VQSNNVSAVNE,nt,V,1469,false,"Arg/N-end rule seed, prt6 vs. Wt",99,29168982,"MASCOT Score",47.7200000,,,,,4.5379998482531E-5,0.2832199
SNNVSAVNEALNEIYVEEEDYDR,nt,S,1471,true,"Arg/N-end rule seed, prt6 vs. Wt",99,29168982,"MASCOT Score",38.3500000,,,,,0.0041649998165667,-2.4590529
IEKHELVEMR,ac,K,1515,false,"Histone deacetylases substrates - hda14 vs WT",98e,29061669,"MaxQuant Score",49.1000000,1.0000000,-0.0070000,0.9931160,NO,0.0040000001899898,
IEKHELVEMR,ac,K,1515,false,"Quantitative Acetylproteomics",101,29440448,,,,,,,,
EYSGKVDELIK,ph,Y,1620,false,"SIRK1 phosphorylation",86a,23820729,"MaxQuant Score",110.0900000,0.9950000,,,,0.030999999493361,4.1430000
EYSGKVDELIK,ph,Y,1620,false,"SIRK1 exp - sirk1 mutant vs WT",86b,23820729,,,,0.3987137,,NO,,
EYSGKVDELIK,ph,Y,1620,false,"SIRK1 exp - 35S:SIRK1 vs WT",86c,23820729,,,,-1.8642103,,NO,,
