Peptide,PTM,ModifiedAA,ModifiedPosition,PeptideUniqueToGene,ExperimentDesc,ExpID,PubmedID,ScoreType,IdentScore,LocProb,Log2FChange,PQ-val,QuantSig,PEP,MassErrorPPM
EIKTIFEK,ac,K,28,true,"Quantitative Acetylproteomics",101,29440448,,,,,,,,
EDAQSIINSASSLLHR,ph,S,71,true,"Tissue atlas Arabidopsis - ProteomicsDB",114,32188942,"MaxQuant score",143.6700000,0.8446830,,,,8.5236900870811E-10,
EFPSPNSLKR,ac,K,240,true,"Quantitative Acetylproteomics",101,29440448,,,,,,,,
EYKEGKDVEVVQK,ub,K,257,true,"Ubiquitination Membrane Proteins",120,33585938,,,,,,,,
EGKDVEVVQK,ub,K,257,true,"upl3 mutant / wildtype",168,35926874,"MaxQuant score",94.3090000,1.0000000,1.0949116,,,0.0019777799025178,0.1363900
DVEVVQKGK,ub,K,264,true,"upl3 mutant / wildtype",168,35926874,"MaxQuant score",96.9480000,1.0000000,-0.2898273,,,0.0044839000329375,-0.1596900
GKDLGDEEVWGR,ub,K,266,true,"Ubiquitination Membrane Proteins",120,33585938,,,,,,,,
GKDLGDEEVWGR,ub,K,266,true,"upl3 mutant / wildtype",168,35926874,"MaxQuant score",138.2400000,1.0000000,0.7891032,0.3806600,NO,1.6417299741889E-9,-0.0363530
GKDLGDEEVWGREVPSFIQR,ph,S,280,true,"MAPK Arabidopsis substrates",45,23172892,"MaxQuant Score",115.8700000,,,,,,
EVPSFIQR,ph,S,280,true,"Arabidopsis root NAA phosphoproteome",18a,27643528,"MaxQuant Score",51.2760000,1.0000000,,,,0.0020000000949949,-0.0550000
EVPSFIQR,ph,S,280,true,"Plasmamembrane phosphorylation",20,15308754,,,,,,,,
EVPSFIQR,ph,S,280,true,"Sucrose-induced phosphorylation",24,17586839,,,,,,,,
EVPSFIQR,ph,S,280,true,"Plasmembrane Ph Immune Responses",25,17651370,,,,,,,,
EVPSFIQR,ph,S,280,true,"MAPK Arabidopsis substrates",45,23172892,"MaxQuant Score",66.2700000,,,,,,
EVPSFIQR,ph,S,280,true,"Phosphoproteome ethylene-regulated time response",46,24043427,"MASCOT Score",39.2800000,,,,,,6.6173000
EVPSFIQR,ph,S,280,true,"PAMP-triggered phosphorylation",48,24601666,"MASCOT Score",23.3900000,,,,,,
EVPSFIQR,ph,S,280,true,"Tyrosine phosphorylation in Arabidopsis",59,18463617,"MASCOT Score",41.0000000,,,,,,-0.4741655
EVPSFIQR,ph,S,280,true,"srk2dei ABA signaling phopshoproteomics",83,23572148,"MASCOT Score",52.0000000,,,,,,0.0006000
EVPSFIQR,ph,S,280,true,"SIRK1 phosphorylation",86a,23820729,"MaxQuant Score",122.8500000,1.0000000,,,,0.056000001728535,7.7020000
EVPSFIQR,ph,S,280,true,"SIRK1 exp - sirk1 mutant vs WT",86b,23820729,,,,-0.1675755,,NO,,
EVPSFIQR,ph,S,280,true,"SIRK1 exp - 35S:SIRK1 vs WT",86c,23820729,,,,-0.9209907,,NO,,
EVPSFIQR,ph,S,280,true,"atm and atr DNA damage response",88,25561503,"MASCOT Score",45.0000000,1.0000000,,,,,0.1400000
EVPSFIQR,ph,S,280,true,"TOR Kinase and ABA Receptor",100,29290610,XCorr,2.0709054,1.0000000,,,,0.089450001716614,
EVPSFIQR,ph,S,280,true,"Col-0 callus - FC Col-0 vs. Col-0 Xray",111a,31410901,,31.2300000,,-0.0675024,0.0000000,NO,,0.1246694
EVPSFIQR,ph,S,280,true,"Col-0 X-ray callus - FC Col-0 vs. Col-0 Xray",111b,31410901,,31.2300000,,-0.0675024,0.0000000,NO,,0.1246694
EVPSFIQR,ph,S,280,true,"atm callus - FC atm vs. atm Xray",111c,31410901,,31.2300000,,-0.9970463,0.0000000,NO,,0.1246694
EVPSFIQR,ph,S,280,true,"atm-3 X-ray callus - FC atm vs. atm Xray",111d,31410901,,31.2300000,,-0.9970463,0.0000000,NO,,0.1246694
EVPSFIQR,ph,S,280,true,"Tissue atlas Arabidopsis - ProteomicsDB",114,32188942,"MaxQuant score",107.1500000,1.0000000,,,,0.0039534200914204,
EVPSFIQR,ph,S,280,true,"Touch-induced phosphorylation: 40s touch vs untouc",136,30291188,"MASCOT score",36.1000000,,1.2193431,0.0000121,YES,,7.7186456
VPSFIQR,ph,S,280,false,"Phosphorylation Early Elicitor Signaling",23,17317660,,,,,,,,
VPSFIQR,ph,S,280,false,"Sucrose-induced phosphorylation",24,17586839,,,,,,,,
VPSFIQR,ph,S,280,false,"Phytohormone-responsive phosphoproteins",34,20374526,"MASCOT Score",49.0000000,,,,,,15.7053000
VPSFIQR,ph,S,280,false,"LAXIC - ABA stress",84a,23660473,XCorr,2.6500000,1.0000000,,,,0.017240999266505,
NKSEAKDDLDGNDDDDDDDDEDK,ph,S,287,true,"Phytohormone-responsive phosphoproteins",34,20374526,"MASCOT Score",63.0000000,,,,,,-2.7462800
NKSEAKDDLDGNDDDDDDDDEDK,ph,S,287,true,"STN8 phosphoproteome",38,21768351,"MASCOT Score",104.7400000,,,,,,-1.4477500
NKSEAKDDLDGNDDDDDDDDEDK,ph,S,287,true,"TOR Kinase and ABA Receptor",100,29290610,XCorr,5.2503152,1.0000000,,,,7.0540001617658E-10,
HLIAIHAGKPKGGITECLK,ub,K,328,true,"upl3 mutant / wildtype",168,35926874,"MaxQuant score",104.8800000,0.8220000,1.7294440,0.0914370,NO,1.2611700572762E-10,-0.5523900
GGITECLK,ph,T,332,false,"atm and atr DNA damage response",88,25561503,"MASCOT Score",42.0000000,1.0000000,,,,,-2.0300000
GGITECLK,sno,C,334,false,"hot5-4 / wildtype, FAT-switch S-nitrosoproteome",169,37277371,,,,0.3470373,0.0044110,NO,,
RLSLSEEQLEK,ph,S,346,false,"atm and atr DNA damage response",88,25561503,"MASCOT Score",53.0000000,0.9470000,,,,,-0.6600000
RLSLSEEQLEK,ph,S,346,false,"TOR Kinase and ABA Receptor",100,29290610,XCorr,3.2774088,0.9924000,,,,8.9339999249205E-5,
RLSLSEEQLEK,ph,S,346,false,"Tissue atlas Arabidopsis - ProteomicsDB",114,32188942,"MaxQuant score",222.8800000,0.9999180,,,,5.0505801712591E-33,
SGSDSDIFDPK,ph,S,437,true,"atm and atr DNA damage response",88,25561503,"MASCOT Score",28.0000000,0.9950000,,,,,-0.6400000
SGSDSDIFDPK,ph,S,437,true,"Tissue atlas Arabidopsis - ProteomicsDB",114,32188942,"MaxQuant score",151.5500000,0.9977930,,,,1.1631000162993E-8,
SGSDSDIFDPK,ph,S,439,true,"atm and atr DNA damage response",88,25561503,"MASCOT Score",25.0000000,0.9960000,,,,,0.7900000
SGSDSDIFDPK,ph,S,439,true,"Tissue atlas Arabidopsis - ProteomicsDB",114,32188942,"MaxQuant score",132.9900000,0.9987650,,,,3.0554099339497E-6,
ATLPVKTTLR,ac,K,451,false,"Quantitative Acetylproteomics",101,29440448,,,,,,,,
VGIAGVPGDTVMKK,ub,K,497,true,"Ubiquitination Membrane Proteins",120,33585938,,,,,,,,
VGIAGVPGDTVMKK,ub,K,497,true,"upl3 mutant / wildtype",168,35926874,"MaxQuant score",98.9420000,1.0000000,-1.8365013,0.2412200,NO,1.0081400432682E-5,-0.3186700
DDFGGQTCLPVWELSEGIRAFPLHSR,ph,T,545,true,"Large-scale phosphorylation discovery",44,23111157,XCorr,3.5360000,,,,,,
