Peptide,PTM,ModifiedAA,ModifiedPosition,PeptideUniqueToGene,ExperimentDesc,ExpID,PubmedID,ScoreType,IdentScore,LocProb,Log2FChange,PQ-val,QuantSig,PEP,MassErrorPPM
QMTSSQFHK,ph,T,6,false,"atm and atr DNA damage response",88,25561503,"MASCOT Score",34.0000000,1.0000000,,,,,-1.3000000
QMTSSQFHK,ph,T,6,false,"Tissue atlas Arabidopsis - ProteomicsDB",114,32188942,"MaxQuant score",167.1000000,0.9999990,,,,0.00026548799360171,
QMTSSQFHK,ph,S,8,false,"Tissue atlas Arabidopsis - ProteomicsDB",114,32188942,"MaxQuant score",127.8300000,0.9924850,,,,0.00016230400069617,
SSLRHSGTIR,ph,S,288,true,"Tissue atlas Arabidopsis - ProteomicsDB",114,32188942,"MaxQuant score",126.7100000,0.9948370,,,,1.8762699255603E-5,
SKLPVIGGASFR,ph,S,338,true,"Tissue atlas Arabidopsis - ProteomicsDB",114,32188942,"MaxQuant score",112.7200000,1.0000000,,,,0.0001111800011131,
LPVIGGASFR,ph,S,338,true,"atm and atr DNA damage response",88,25561503,"MASCOT Score",28.0000000,1.0000000,,,,,-0.9200000
LPVIGGASFR,ph,S,338,true,"TOR Kinase and ABA Receptor",100,29290610,XCorr,3.1390104,1.0000000,,,,0.0048299999907613,
DQSSPSDLGEEGTDSEDDINSDQGPTLSMHDK,ph,T,356,true,"TOR Kinase and ABA Receptor",100,29290610,XCorr,4.0287957,0.9917000,,,,0.00079119997099042,
DQSSPSDLGEEGTDSEDDINSDQGPTLSMHDK,ph,S,358,true,"TOR Kinase and ABA Receptor",100,29290610,XCorr,4.0287957,0.9981000,,,,0.00079119997099042,
QSGTCSISSDAK,ph,S,380,true,"Tissue atlas Arabidopsis - ProteomicsDB",114,32188942,"MaxQuant score",130.5800000,0.8746720,,,,3.8893198507139E-5,
GTSQDVLENHEK,ph,S,393,true,"Tissue atlas Arabidopsis - ProteomicsDB",114,32188942,"MaxQuant score",123.9900000,0.9928480,,,,3.5221801226726E-5,
EYSIQSSHSFSQK,ph,S,434,true,"Tissue atlas Arabidopsis - ProteomicsDB",114,32188942,"MaxQuant score",147.3900000,0.9999990,,,,9.7809504495672E-7,
EYSIQSSHSFSQK,ph,S,440,true,"atm and atr DNA damage response",88,25561503,"MASCOT Score",46.0000000,0.9240000,,,,,0.4500000
EYSIQSSHSFSQK,ph,S,440,true,"Tissue atlas Arabidopsis - ProteomicsDB",114,32188942,"MaxQuant score",268.5000000,0.9991520,,,,0,
AVKTPSSFGGNELTR,ph,T,455,true,"Tissue atlas Arabidopsis - ProteomicsDB",114,32188942,"MaxQuant score",159.8100000,0.9999970,,,,1.4265099518296E-12,
TPSSFGGNELTR,ph,S,457,true,"Tissue atlas Arabidopsis - ProteomicsDB",114,32188942,"MaxQuant score",164.5600000,0.9939570,,,,1.4917500568146E-10,
AVKTPSSFGGNELTR,ph,S,458,true,"Tissue atlas Arabidopsis - ProteomicsDB",114,32188942,"MaxQuant score",128.5900000,0.9908650,,,,0.00014494500646833,
FSDPPGDASLHDLFHPLDK,ph,S,475,false,"Tissue atlas Arabidopsis - ProteomicsDB",114,32188942,"MaxQuant score",57.8020000,0.9999760,,,,0.00029565099976026,
TNEASTSTPTANVNQGDSPVADGGK,ph,S,508,true,"TOR Kinase and ABA Receptor",100,29290610,XCorr,4.0866842,1.0000000,,,,1.460000021325E-5,
TNEASTSTPTANVNQGDSPVADGGK,ph,S,508,true,"Tissue atlas Arabidopsis - ProteomicsDB",114,32188942,"MaxQuant score",185.3400000,1.0000000,,,,0,
QMEGETGHSQDGGDLFR,ph,T,535,true,"Tissue atlas Arabidopsis - ProteomicsDB",114,32188942,"MaxQuant score",46.5780000,0.7557630,,,,0.006209310144186,
QMEGETGHSQDGGDLFR,ph,S,538,true,"atm and atr DNA damage response",88,25561503,"MASCOT Score",63.0000000,1.0000000,,,,,-0.3600000
QMEGETGHSQDGGDLFR,ph,S,538,true,"Tissue atlas Arabidopsis - ProteomicsDB",114,32188942,"MaxQuant score",124.8600000,0.9998420,,,,4.2943801292772E-10,
LASISGDALILDGQTPR,ph,T,791,true,"STN8 phosphoproteome",38,21768351,"MASCOT Score",57.4700000,,,,,,-2.6778900
LASISGDALILDGQTPR,ph,T,791,true,"Pollen phosphoproteome Arabidopsis",43,22631563,"MASCOT Score",102.8900000,,,,,,-2.2464600
LASISGDALILDGQTPR,ph,T,791,true,"Tissue atlas Arabidopsis - ProteomicsDB",114,32188942,"MaxQuant score",251.3500000,1.0000000,,,,0,
ARSGQLDPNNPIFSQR,ph,S,796,true,"atm and atr DNA damage response",88,25561503,"MASCOT Score",50.0000000,1.0000000,,,,,0.0900000
ARSGQLDPNNPIFSQR,ph,S,796,true,"TOR Kinase and ABA Receptor",100,29290610,XCorr,3.9315150,1.0000000,,,,2.3459999283659E-5,
SGQLDPNNPIFSQR,ph,S,796,true,"atm and atr DNA damage response",88,25561503,"MASCOT Score",58.0000000,1.0000000,,,,,-0.5100000
SGQLDPNNPIFSQR,ph,S,796,true,"Tissue atlas Arabidopsis - ProteomicsDB",114,32188942,"MaxQuant score",172.4300000,1.0000000,,,,7.5257601520168E-16,
IFSQR,ph,S,807,false,"Phosphorylation Early Elicitor Signaling",23,17317660,,,,,,,,
IFSQR,ph,S,807,false,"Lateral root-induction - NAA vs control",106,23328941,"MASCOT Score",21.0000000,,,,,,
ETSPSVIDHPDGLK,ph,S,812,true,"atm and atr DNA damage response",88,25561503,"MASCOT Score",28.0000000,0.9440000,,,,,0.0600000
ETSPSVIDHPDGLK,ph,S,812,true,"Tissue atlas Arabidopsis - ProteomicsDB",114,32188942,"MaxQuant score",151.0700000,0.9969790,,,,2.0250300281077E-7,
ETSPSVIDHPDGLK,ph,S,814,true,"Tissue atlas Arabidopsis - ProteomicsDB",114,32188942,"MaxQuant score",44.5110000,0.7754370,,,,0.0073053501546383,
LSSVVADATEDVIQQHR,ph,S,861,true,"Tissue atlas Arabidopsis - ProteomicsDB",114,32188942,"MaxQuant score",255.1600000,0.9028440,,,,0,
LSSVVADATEDVIQQHR,ph,S,862,true,"Tissue atlas Arabidopsis - ProteomicsDB",114,32188942,"MaxQuant score",182.1700000,0.9971250,,,,9.0922099431583E-30,
ISLSANR,ph,S,878,false,"Tissue atlas Arabidopsis - ProteomicsDB",114,32188942,"MaxQuant score",113.9400000,0.9999960,,,,0.0011443899711594,
ISLSANR,ph,S,880,false,"Tissue atlas Arabidopsis - ProteomicsDB",114,32188942,"MaxQuant score",77.3550000,0.9999880,,,,0.00040233999607153,
ISLSANRTSTDKLQK,ph,T,884,false,"Tissue atlas Arabidopsis - ProteomicsDB",114,32188942,"MaxQuant score",133.8600000,0.8669060,,,,8.8857302671386E-7,
ISLSANRTSTDK,ph,S,885,false,"atm and atr DNA damage response",88,25561503,"MASCOT Score",42.0000000,0.8570000,,,,,-0.2100000
ISLSANRTSTDK,ph,S,885,false,"TOR Kinase and ABA Receptor",100,29290610,XCorr,4.3300996,0.9178000,,,,0.0094419997185469,
ISLSANRTSTDK,ph,S,885,false,"Phospho cell culture sucrose/TOR",109,30833711,,,0.8569190,,,,,
ISLSANRTSTDK,ph,S,885,false,"Tissue atlas Arabidopsis - ProteomicsDB",114,32188942,"MaxQuant score",190.1800000,0.9596340,,,,6.0072799228975E-24,
TSTDKLQK,ph,S,885,false,"atm and atr DNA damage response",88,25561503,"MASCOT Score",34.0000000,0.9380000,,,,,-0.7000000
ISLSANRTSTDKLQK,ph,T,886,false,"Phosphoproteome ethylene-regulated time response",46,24043427,"MASCOT Score",36.7000000,,,,,,-18.9249000
KISGQLDYVK,ph,S,925,true,"atm and atr DNA damage response",88,25561503,"MASCOT Score",48.0000000,1.0000000,,,,,-2.3400000
KISGQLDYVK,ph,S,925,true,"TOR Kinase and ABA Receptor",100,29290610,XCorr,3.1461577,1.0000000,,,,0.00074430002132431,
KISGQLDYVK,ph,S,925,true,"Tissue atlas Arabidopsis - ProteomicsDB",114,32188942,"MaxQuant score",191.6900000,1.0000000,,,,1.1090800044848E-13,
HESRLPLLYASDEKK,ph,S,942,true,"Tissue atlas Arabidopsis - ProteomicsDB",114,32188942,"MaxQuant score",53.7790000,0.9997720,,,,0.0016973300371319,
HESRLPLLYASDEK,ph,S,942,true,"atm and atr DNA damage response",88,25561503,"MASCOT Score",43.0000000,1.0000000,,,,,0.1200000
HESRLPLLYASDEK,ph,S,942,true,"TOR Kinase and ABA Receptor",100,29290610,XCorr,2.5905645,0.9998000,,,,0.00078990001929924,
VASTCGIASQTASGVLSGSGVLNAR,ph,S,1002,true,"Tissue atlas Arabidopsis - ProteomicsDB",114,32188942,"MaxQuant score",263.8700000,0.8923930,,,,0,
ILECTNHLSTDPNCLENLQR,sno,C,1095,false,"hot5-4 / wildtype, FAT-switch S-nitrosoproteome",169,37277371,,,,0.0227708,0.9033609,NO,,
