Peptide,PTM,ModifiedAA,ModifiedPosition,PeptideUniqueToGene,ExperimentDesc,ExpID,PubmedID,ScoreType,IdentScore,LocProb,Log2FChange,PQ-val,QuantSig,PEP,MassErrorPPM
SLVSGARDMGFDDNNNNKNNKDGDDE,nta,S,2,true,"HUNTER N-terminome: legumain, GluC and trypsin",119,31951383,"MaxQuant score",49.2870000,,,,,,
SLVSGARDMGFDDN,nta,S,2,true,"HUNTER N-terminome: legumain, GluC and trypsin",119,31951383,"MaxQuant score",104.3000000,,,,,,
SLVSGAR,nta,S,2,true,"Arabidopsis translation initiation landscape - NTA",167a,35069635,,,,,,,,
TRADDDALSR,ph,S,41,true,"atm and atr DNA damage response",88,25561503,"MASCOT Score",31.0000000,1.0000000,,,,,-0.1800000
TRADDDALSR,ph,S,41,true,"Tissue atlas Arabidopsis - ProteomicsDB",114,32188942,"MaxQuant score",119.2500000,1.0000000,,,,0.00029274600092322,
ADDDALSR,ph,S,41,true,"atm and atr DNA damage response",88,25561503,"MASCOT Score",33.0000000,1.0000000,,,,,0.4500000
QMSESSLCATEEEEDDDSKLQLGPQYTIK,ph,S,45,true,"Tissue atlas Arabidopsis - ProteomicsDB",114,32188942,"MaxQuant score",276.0100000,1.0000000,,,,0,
QMSESSLCATEEEEDDDSK,ph,S,45,true,"Tyrosine phosphorylation in Arabidopsis",59,18463617,"MASCOT Score",87.0000000,,,,,,-0.6170688
QMSESSLCATEEEEDDDSK,ph,S,45,true,"srk2dei ABA signaling phopshoproteomics",83,23572148,"MASCOT Score",92.0000000,,,,,,-0.0009000
QMSESSLCATEEEEDDDSK,ph,S,45,true,"atm and atr DNA damage response",88,25561503,"MASCOT Score",34.0000000,1.0000000,,,,,-0.8100000
QMSESSLCATEEEEDDDSK,ph,S,47,true,"Conserved plant phosphoproteome - Arabidopsis",61a,20466843,"MASCOT Score",98.0000000,1.0000000,,,,,
QMSESSLCATEEEEDDDSK,ph,S,47,true,"srk2dei ABA signaling phopshoproteomics",83,23572148,"MASCOT Score",57.0000000,,,,,,-0.0030000
QMSESSLCATEEEEDDDSK,ph,S,47,true,"atm and atr DNA damage response",88,25561503,"MASCOT Score",34.0000000,1.0000000,,,,,-0.8100000
QMSESSLCATEEEEDDDSK,ph,S,47,true,"Tissue atlas Arabidopsis - ProteomicsDB",114,32188942,"MaxQuant score",130.2700000,0.8701420,,,,3.821289982687E-32,
QMSESSLCATEEEEDDDSKLQLGPQYTIK,ph,S,48,true,"Tissue atlas Arabidopsis - ProteomicsDB",114,32188942,"MaxQuant score",242.1200000,0.9886650,,,,0,
QMSESSLCATEEEEDDDSK,ph,S,48,true,"Large-scale phosphorylation discovery",44,23111157,XCorr,3.9920000,,,,,,
QMSESSLCATEEEEDDDSK,ph,S,48,true,"Conserved plant phosphoproteome - Arabidopsis",61a,20466843,"MASCOT Score",98.0000000,1.0000000,,,,,
QMSESSLCATEEEEDDDSK,ph,S,48,true,"srk2dei ABA signaling phopshoproteomics",83,23572148,"MASCOT Score",81.0000000,,,,,,-0.0021000
QMSESSLCATEEEEDDDSK,ph,S,48,true,"atm and atr DNA damage response",88,25561503,"MASCOT Score",32.0000000,1.0000000,,,,,0.5800000
QMSESSLCATEEEEDDDSKLQLGPQYTIK,ph,T,52,true,"Tissue atlas Arabidopsis - ProteomicsDB",114,32188942,"MaxQuant score",209.4800000,0.9999990,,,,0,
QMSESSLCATEEEEDDDSK,ph,T,52,true,"srk2dei ABA signaling phopshoproteomics",83,23572148,"MASCOT Score",78.0000000,,,,,,-0.0037000
QMSESSLCATEEEEDDDSK,ph,T,52,true,"atm and atr DNA damage response",88,25561503,"MASCOT Score",50.0000000,1.0000000,,,,,0.4700000
LQLGPQYTIKEHLEK,ph,T,69,true,"Tissue atlas Arabidopsis - ProteomicsDB",114,32188942,"MaxQuant score",170.2200000,1.0000000,,,,4.2735700703678E-17,
LQLGPQYTIK,ph,T,69,true,"TOR Kinase and ABA Receptor",100,29290610,XCorr,2.5377722,0.9947000,,,,0.0095790000632405,
DKDDESLRK,ph,S,82,true,"Tissue atlas Arabidopsis - ProteomicsDB",114,32188942,"MaxQuant score",101.5600000,1.0000000,,,,0.0012582200579345,
SVDVTNIGETLDPEVR,nt,S,93,true,"Arg/N-end rule seed, prt6 vs. Wt",99,29168982,"MASCOT Score",53.1800000,,-0.0878179,0.8453451,NO,0.015890000388026,-2.1855744
EQLLGSVDVTNIGETLDPEVR,ph,S,93,true,"Tissue atlas Arabidopsis - ProteomicsDB",114,32188942,"MaxQuant score",168.2700000,1.0000000,,,,6.1851902603276E-36,
ETLDPEVR,nt,E,101,true,"Arg/N-end rule seed, prt6 vs. Wt",99,29168982,"MASCOT Score",32.6500000,,-0.7281448,0.0033724,NO,0.15510000288486,-0.8939346
