Peptide,PTM,ModifiedAA,ModifiedPosition,PeptideUniqueToGene,ExperimentDesc,ExpID,PubmedID,ScoreType,IdentScore,LocProb,Log2FChange,PQ-val,QuantSig,PEP,MassErrorPPM
ESSAAASDSSSQAPPPAEKFEYQAEVSR,nt,E,78,true,"Arg/N-end rule pathway Roots",80,25728785,"MASCOT Score",95.2100000,,,,,9.534999776406E-7,
ESSAAASDSSSQAPPPAEKFEYQAEVSR,nt,E,78,true,"Stromal N-terminome",96,26371235,"MASCOT Score",72.2300000,,,,,,
ESSAAASDSSSQAPPPAEKFEYQAEVSR,nt,E,78,true,"Arg/N-end rule seed, prt6 vs. Wt",99,29168982,"MASCOT Score",28.5900000,,0.1805496,0.7496354,NO,0.013199999928474,-0.5960245
ESSAAASDSSSQAPPPAEKFEYQAEVSR,nt,E,78,true,"FtsH12 N-terminome: WT / FtsH12 knockdown miRNA",118,33216923,"MaxQuant score",62.8900000,,0.9174860,0.0285960,YES,0.0026489000301808,
ESSAAASDSSSQAPPPAEKFEYQAEVSR,nt,E,78,true,"HUNTER N-terminome: legumain, GluC and trypsin",119,31951383,"MaxQuant score",145.1400000,,,,,,
ESSAAASDSSSQAPPPAEKFEYQAEVSR,nt,E,78,true,"Arabidopsis translation initiation landscape - NT",167b,35069635,,,,,,,,
ESSAAASDSSSQAPPPAEKFE,nt,E,78,true,"HUNTER N-terminome: legumain, GluC and trypsin",119,31951383,"MaxQuant score",203.2700000,,,,,,
EVFLRELISNASDALDK,ph,S,127,true,"SnRK2 protein kinase substrates",85,23776212,XCorr,3.0238326,1.0000000,,,,0.16003699600697,
ELISNASDALDKLR,ng,N,128,true,"Conserved N-glycosylation",74,22633491,"MaxQuant Score",95.4240000,1.0000000,,,,9.5720002718735E-5,-0.7630000
ELISNASDALDK,ng,N,128,false,"Conserved N-glycosylation",74,22633491,"MaxQuant Score",90.2810000,1.0000000,,,,0.00025109999114648,-1.0640000
EVFLRELISNASDALDK,ph,S,130,true,"SnRK2 protein kinase substrates",85,23776212,XCorr,3.0238326,1.0000000,,,,0.16003699600697,
QELVDCLGTIAQSGTAK,sno,C,183,true,"Site-specific nitrosomeproteomic id - gsnor1-3",90b,25699590,XCorr,3.7400000,,,,,0.020300000905991,-5.8800000
QELVDCLGTIAQSGTAK,sno,C,183,true,"hot5-4 / wildtype, FAT-switch S-nitrosoproteome",169,37277371,,,,1.4702342,0.0004218,YES,,
QELVDCLGTIAQSGTAK,so,C,183,true,"Arabidopsis S-sulfenylation chemoproteomics",108,31578252,"pFind PSM Score",0.0087004,,,,,,0.6728605
QELVDCLGTIAQSGTAK,so,C,183,true,"S-sulfenylation site detection using YAP1C",110,32714340,,,,,,,,
EVTTAEYNEFYR,ph,Y,371,true,"Lateral root-induction - NAA vs control",106,23328941,"MASCOT Score",23.0000000,,,,,,
SILYVPPVSPSGKDDIVNQK,ph,S,409,true,"Large-scale phosphorylation discovery",44,23111157,XCorr,3.1650000,,,,,,
SILYVPPVSPSGKDDIVNQK,ph,S,409,true,"Tissue atlas Arabidopsis - ProteomicsDB",114,32188942,"MaxQuant score",172.6000000,0.9971900,,,,4.2863199031707E-35,
SILYVPPVSPSGK,ph,S,411,true,"TOR Kinase and ABA Receptor",100,29290610,XCorr,2.2445500,0.9977000,,,,0.0078189997002482,
VFISDDFDGELFPR,nt,V,431,false,"Stromal N-terminome",96,26371235,"MASCOT Score",33.1700000,,,,,,
LGCIEDR,sno,C,515,true,"hot5-4 / wildtype, FAT-switch S-nitrosoproteome",169,37277371,,,,0.5519003,0.0133413,NO,,
LGCIEDR,so,C,515,true,"Arabidopsis S-sulfenylation chemoproteomics",108,31578252,"pFind PSM Score",0.3530670,,,,,,0.8116860
LGCIEDR,so,C,515,true,"S-sulfenylation site detection using YAP1C",110,32714340,,,,,,,,
EFGQTCDWIK,ox,C,636,true,"SPEAR - 10 mM H2O2 / mock",138a,34619326,,,,2.2344119,0.0081275,YES,,
KEFGQTCDWIK,sno,C,636,true,"Site-specific nitrosomeproteomic id - gsnor1-3",90b,25699590,XCorr,2.5800000,,,,,0.038759998977184,-7.4500000
EFGQTCDWIK,sno,C,636,true,"hot5-4 / wildtype, FAT-switch S-nitrosoproteome",169,37277371,,,,1.6202081,0.0002756,YES,,
KEFGQTCDWIK,so,C,636,true,"Arabidopsis S-sulfenylation chemoproteomics",108,31578252,"pFind PSM Score",0.0879617,,,,,,-1.7610819
KEFGQTCDWIK,so,C,636,true,"S-sulfenylation site detection using YAP1C",110,32714340,,,,,,,,
LSSSPCVLVSGK,ph,S,658,false,"Tissue atlas Arabidopsis - ProteomicsDB",114,32188942,"MaxQuant score",105.9500000,0.9840430,,,,8.660439925734E-5,
LSSSPCVLVSGK,ox,C,661,false,"OxiTRAQ Arabidopsis - 5 mM H2O2 versus control",47,24376095,,,,0.4009766,0.0131603,NO,,
LSSSPCVLVSGK,ox,C,661,false,"Redox kickstart of mitochondria",112,31871212,,,,-1.3563196,0.0011494,YES,,
LSSSPCVLVSGK,ox,C,661,false,"SPEAR - 10 mM H2O2 / mock",138a,34619326,,,,-2.8301562,0.0272571,YES,,
LSSSPCVLVSGK,sno,C,661,false,"Site-specific nitrosomeproteomic id - gsnor1-3",90a,25699590,XCorr,2.0772061,,,,,0.0099430000409484,-7.1671099
LSSSPCVLVSGK,sno,C,661,false,"Site-specific nitrosomeproteomic id - gsnor1-3",90b,25699590,XCorr,2.4000000,,,,,0.15770000219345,-6.8700000
LSSSPCVLVSGK,sno,C,661,false,"hot5-4 / wildtype, FAT-switch S-nitrosoproteome",169,37277371,,,,,,,,
LSSSPCVLVSGK,so,C,661,false,"Arabidopsis S-sulfenylation chemoproteomics",108,31578252,"pFind PSM Score",0.0118407,,0.8366100,,,,-0.9136178
