Peptide,PTM,ModifiedAA,ModifiedPosition,PeptideUniqueToGene,ExperimentDesc,ExpID,PubmedID,ScoreType,IdentScore,LocProb,Log2FChange,PQ-val,QuantSig,PEP,MassErrorPPM
QQACKSQNLNSAGPFDSCE,nt,Q,47,true,"HUNTER N-terminome: legumain, GluC and trypsin",119,31951383,"MaxQuant score",43.7940000,,,,,,
TYNISSYSSLVEGK,ng,N,135,true,"Conserved N-glycosylation",74,22633491,"MaxQuant Score",152.5800000,1.0000000,,,,4.9989998005692E-35,-0.0680000
TYNISSYSSLVEGK,ng,N,135,true,"N-glycan occupancy Arabidopsis glycoproteins",87,23994444,"Ladder score",87.7000000,,,,,,
TYNISSYSSLVEGK,ng,N,135,true,"N-Glycopeptide Profiling in Arabidopsis Infloresce",132,27067053,"MOWSE score",25.1000000,,,,,0.00088000000687316,
TYNISSYSSLVEGK,ng,N,135,true,"N-linked Glycan Micro-heterogeneity Arabidopsis",134,29237727,,,,,,,,
TYNISSYSSLVEGK,ng,N,135,true,"UDP-GlcNAc transporter glycopeptide analysis",135,30224661,,,,,,,4.8674380218596E-18,0.5000000
SGGGAAPVVKTYNISSYSSLVEGK,ph,S,137,true,"srk2dei ABA signaling phopshoproteomics",83,23572148,"MASCOT Score",31.0000000,,,,,,-0.0066000
VPAGADSVNQVWQIGGNVTNGRPGVHPFGPDNLGSHR,ng,N,188,true,"Conserved N-glycosylation",74,22633491,"MaxQuant Score",300.5200000,0.9970000,,,,0,0.5530000
VPAGADSVNQVWQIGGNVTNGRPGVHPFGPDNLGSHR,ng,N,188,true,"N-linked Glycan Micro-heterogeneity Arabidopsis",134,29237727,,,,,,,,
VPAGADSVNQVWQIGGNVTNGRPGVHPFGPDNLGSHR,ng,N,188,true,"UDP-GlcNAc transporter glycopeptide analysis",135,30224661,,,,,,,6.4496330570332E-21,0.3000000
VPAGADSVNQVWQIGGNVTNGRPGVHPFGPDNLGSHR,ng,N,188,true,"Open search Plant PTM Viewer 2.0 - N-glycosylation",164a,TBA,,,,,,,,
VPAGADSVNQVWQIGGNVTNGR,ng,N,188,true,"UDP-GlcNAc transporter glycopeptide analysis",135,30224661,,,,,,,6.4912972100319E-17,0.3000000
