Peptide,PTM,ModifiedAA,ModifiedPosition,PeptideUniqueToGene,ExperimentDesc,ExpID,PubmedID,ScoreType,IdentScore,LocProb,Log2FChange,PQ-val,QuantSig,PEP,MassErrorPPM
SQNEEFQQWWNK,ph,S,4,true,"Tissue atlas Arabidopsis - ProteomicsDB",114,32188942,"MaxQuant score",214.0600000,1.0000000,,,,7.2874106247673E-39,
TPATVDPDKDR,ph,T,40,true,"Tissue atlas Arabidopsis - ProteomicsDB",114,32188942,"MaxQuant score",121.0100000,0.9993440,,,,0.00011409400030971,
TVRQLSR,ph,S,60,true,"srk2dei ABA signaling phopshoproteomics",83,23572148,"MASCOT Score",26.0000000,,,,,,-0.0002000
ALEDCGGWLER,sno,C,402,true,"hot5-4 / wildtype, FAT-switch S-nitrosoproteome",169,37277371,,,,0.2440526,0.3232254,NO,,
FDSSYEWVVTK,ph,S,570,true,"BSK8 and BSL2 regulating sucrose-ph synthase",66,24924143,"MaxQuant Score",46.7060000,,,,,,-0.6112400
FDSSYEWVVTK,ph,Y,572,true,"BSK8 and BSL2 regulating sucrose-ph synthase",66,24924143,"MaxQuant Score",46.7060000,,,,,,-0.6112400
FDSSYEWVVTK,ph,T,577,true,"BSK8 and BSL2 regulating sucrose-ph synthase",66,24924143,"MaxQuant Score",46.7060000,,,,,,-0.6112400
SSSDSGLTELSK,ph,S,608,true,"Phosphorylation nuclei-enriched fractions",28,19245862,,,,,,,,
SSSDSGLTELSK,ph,S,608,true,"STN8 phosphoproteome",38,21768351,"MASCOT Score",46.2800000,,,,,,1.0054700
SSSDSGLTELSK,ph,S,608,true,"Phosphoproteome ethylene-regulated time response",46,24043427,"MASCOT Score",68.7000000,,,,,,0.4208100
SSSDSGLTELSK,ph,S,608,true,"Tyrosine phosphorylation in Arabidopsis",59,18463617,"MASCOT Score",74.0000000,,,,,,-0.5428300
SSSDSGLTELSK,ph,S,608,true,"srk2dei ABA signaling phopshoproteomics",83,23572148,"MASCOT Score",69.0000000,,,,,,0.0009000
SSSDSGLTELSK,ph,S,608,true,"LAXIC - ABA stress",84a,23660473,XCorr,3.9400000,0.9650000,,,,3.6999999792897E-6,
SSSDSGLTELSK,ph,S,608,true,"LAXIC - mannitol vs control",84b,23660473,XCorr,3.5400000,0.8440000,,,,0.036471899598837,
SSSDSGLTELSK,ph,S,608,true,"SnRK2 protein kinase substrates",85,23776212,XCorr,2.9110112,0.9420000,,,,0.010665000416338,
SSSDSGLTELSK,ph,S,608,true,"atm and atr DNA damage response",88,25561503,"MASCOT Score",77.0000000,0.9940000,,,,,-0.6700000
SSSDSGLTELSK,ph,S,608,true,"Brassinosteroid-Regulated Phosphorylation Dynamics",94,26187819,"MaxQuant Score",153.0900000,0.9970000,,,,1.2570000069953E-29,2.7050000
SSSDSGLTELSK,ph,S,608,true,"TOR Kinase and ABA Receptor",100,29290610,XCorr,3.6526141,0.7707000,,,,6.0500001382024E-6,
SSSDSGLTELSK,ph,S,608,true,"Phospho cell culture sucrose/TOR",109,30833711,,,0.9995790,,,,,
SSSDSGLTELSK,ph,S,608,true,"Tissue atlas Arabidopsis - ProteomicsDB",114,32188942,"MaxQuant score",210.9300000,1.0000000,,,,2.4391199800043E-31,
SSSDSGLTELSK,ph,S,608,true,"Touch-induced phosphorylation: 40s touch vs untouc",136,30291188,"MASCOT score",101.4600000,,-0.0873738,0.8049565,NO,,5.5783908
