Peptide,PTM,ModifiedAA,ModifiedPosition,PeptideUniqueToGene,ExperimentDesc,ExpID,PubmedID,ScoreType,IdentScore,LocProb,Log2FChange,PQ-val,QuantSig,PEP,MassErrorPPM
MYADKLEAESGSR,nta,M,1,true,"Arg/N-end rule pathway Roots",80,25728785,"MASCOT Score",82.2400000,,,,,1.0320000143338E-7,
MYADKLEAESGSR,nta,M,1,true,"Arg/N-end rule seed, prt6 vs. Wt",99,29168982,"MASCOT Score",41.1700000,,-0.2309561,0.1860691,NO,0.013410000130534,-1.8500284
MYADKLEAESGSR,nta,M,1,true,"FtsH12 N-terminome: WT / FtsH12 knockdown miRNA",118,33216923,"MaxQuant score",69.8250000,,,,,0.062040001153946,
MYADKLEAESGSR,nta,M,1,true,"Arabidopsis translation initiation landscape - NTA",167a,35069635,,,,,,,,
MYADKLEAES,nta,M,1,true,"N-term acetylation drought responses",5,26184543,,,,,,,,
MYADKLEAESGSR,ub,K,5,true,"Arabidopsis ubiquitination COFRADIC",40,26744219,"MaxQuant Score",81.9040000,1.0000000,,,,4.663000072469E-5,-0.1140000
MYADKLEAESGSR,ph,S,10,true,"Tissue atlas Arabidopsis - ProteomicsDB",114,32188942,"MaxQuant score",44.1320000,0.7583870,,,,0.0093025397509336,
INGGSGDISTR,ph,S,24,true,"LAXIC - mannitol vs control",84b,23660473,XCorr,2.7600000,0.9570000,,,,0.032244201749563,
INGGSGDISTR,ph,S,24,true,"Tissue atlas Arabidopsis - ProteomicsDB",114,32188942,"MaxQuant score",75.4830000,0.9905930,,,,0.0018904500175267,
DQLSGTMNQQPK,ph,S,96,true,"Tissue atlas Arabidopsis - ProteomicsDB",114,32188942,"MaxQuant score",79.7950000,0.9424090,,,,0.0014594199601561,
DQLSGTMNQQPKNSDPPKSKAEAAR,ub,K,110,true,"Arabidopsis ubiquitination COFRADIC",40,26744219,"MaxQuant Score",60.4720000,0.9040000,,,,2.1239999981049E-8,-0.1190000
AEAARPSMK,mox,M,120,true,"cat2 Methionine oxidation - 1h stress",62a,25693801,"MASCOT Score",36.0000000,,0.3707674,,NO,,
AEAARPSMK,mox,M,120,true,"cat2 Methionine oxidation - 3h stress",62b,25693801,"MASCOT Score",59.0000000,,0.4070764,,NO,,
PSMKSVATETETR,ub,K,121,true,"Arabidopsis ubiquitination COFRADIC",40,26744219,"MaxQuant Score",126.3200000,1.0000000,,,,2.4479999682225E-15,-0.1010000
