Peptide,PTM,ModifiedAA,ModifiedPosition,PeptideUniqueToGene,ExperimentDesc,ExpID,PubmedID,ScoreType,IdentScore,LocProb,Log2FChange,PQ-val,QuantSig,PEP,MassErrorPPM
SRAESSWER,ph,S,2,true,"Tissue atlas Arabidopsis - ProteomicsDB",114,32188942,"MaxQuant score",57.0190000,0.9997820,,,,0.0071690701879561,
TGLMSVIK,ph,S,96,false,"Tissue atlas Arabidopsis - ProteomicsDB",114,32188942,"MaxQuant score",87.5680000,0.9999990,,,,0.0072992402128875,
TGLMSVIKQK,me2,K,99,false,"Arabidopsis protein methylome",123,31809900,"MaxQuant Score",43.3080000,1.0000000,,,,0.014946900308132,-0.2631200
QLRESGAFTDELER,ph,S,145,true,"Tissue atlas Arabidopsis - ProteomicsDB",114,32188942,"MaxQuant score",82.8770000,0.9999980,,,,9.5760697149672E-5,
VFATLKVLGSVLEQLAK,ph,T,165,true,"Phosphorylation Early Elicitor Signaling",23,17317660,,,,,,,,
VFATLKVLGSVLEQLAK,ph,S,171,true,"Phosphorylation Early Elicitor Signaling",23,17317660,,,,,,,,
GKTSFVEHR,ac,K,475,true,"Quantitative Acetylproteomics",101,29440448,,,,,,,,
IAYIDVVDSPKEGK,ph,S,1225,true,"Tissue atlas Arabidopsis - ProteomicsDB",114,32188942,"MaxQuant score",134.2100000,1.0000000,,,,2.6640700525604E-6,
IAYIDVVDSPK,ph,S,1225,true,"Phosphorylation Early Elicitor Signaling",23,17317660,,,,,,,,
AIVFTRGNAIQTID,nt,A,1273,true,"HUNTER N-terminome: legumain, GluC and trypsin",119,31951383,"MaxQuant score",127.7600000,,,,,,
