Peptide,PTM,ModifiedAA,ModifiedPosition,PeptideUniqueToGene,ExperimentDesc,ExpID,PubmedID,ScoreType,IdentScore,LocProb,Log2FChange,PQ-val,QuantSig,PEP,MassErrorPPM
AEEAHKVTLN,nt,A,2,true,"Arg/N-end rule seed, prt6 vs. Wt",99,29168982,"MASCOT Score",36.9000000,,,,,0.032389998435974,-0.4631279
AEEAHKVTLNVYDLSQGLAR,nta,A,2,true,"FtsH12 N-terminome: WT / FtsH12 knockdown miRNA",118,33216923,"MaxQuant score",105.5700000,,,,,0.0017097999807447,
AEEAHKVTLNVYDLSQGLAR,nta,A,2,true,"Arabidopsis translation initiation landscape - NTA",167a,35069635,,,,,,,,
AEEAHKVTLNVY,nta,A,2,true,"Arg/N-end rule pathway Roots",80,25728785,"MASCOT Score",47.6400000,,,,,0.00017090000619646,
AEEAHKVTLN,nta,A,2,true,"Arg/N-end rule seed, prt6 vs. Wt",99,29168982,"MASCOT Score",36.9000000,,0.0150216,0.8993360,NO,0.032389998435974,-0.4631279
YTAESYNLLTHNCNNFSNEVAQFLVGK,so,C,105,true,"S-sulfenylation site detection using YAP1C",110,32714340,,,,,,,,
VPPVIQPSASKEK,ph,S,208,true,"Tissue atlas Arabidopsis - ProteomicsDB",114,32188942,"MaxQuant score",141.6500000,0.7639570,,,,1.0253400432703E-5,
ASEAAAMATKR,ac,K,252,true,"Quantitative Acetylproteomics",101,29440448,,,,,,,,
ASEAAAMATKR,ub,K,252,true,"Arabidopsis ubiquitination COFRADIC",40,26744219,"MaxQuant Score",67.3850000,1.0000000,,,,0.0020000000949949,-0.6130000
