Peptide,PTM,ModifiedAA,ModifiedPosition,PeptideUniqueToGene,ExperimentDesc,ExpID,PubmedID,ScoreType,IdentScore,LocProb,Log2FChange,PQ-val,QuantSig,PEP,MassErrorPPM
MDSRTKGKTVME,nta,M,1,true,"Arabidopsis translation initiation landscape - NTA",167a,35069635,,,,,,,,
SNYEEALSR,nt,S,41,true,"Arg/N-end rule seed, prt6 vs. Wt",99,29168982,"MASCOT Score",45.3100000,,-0.2787526,0.2054197,NO,0.012679999694228,-1.5809735
HPLMCLDAIEVGIVSGPR,so,C,251,true,"Arabidopsis S-sulfenylation chemoproteomics",108,31578252,"pFind PSM Score",0.0141348,,1.4886800,,,,-0.9807308
LDAIEVGIVSGPR,nt,L,252,true,"Arg/N-end rule seed, prt6 vs. Wt",99,29168982,"MASCOT Score",33.3900000,,-0.2036819,0.2391028,NO,0.0057089999318123,1.5493797
DAIEVGIVSGPR,nt,D,253,true,"Arg/N-end rule seed, prt6 vs. Wt",99,29168982,"MASCOT Score",42.5300000,,0.2641563,0.1161901,NO,0.0051549999043345,-2.6722445
GSLDYESFR,nt,G,382,true,"Arg/N-end rule seed, prt6 vs. Wt",99,29168982,"MASCOT Score",46.7500000,,-0.2772450,0.3866666,NO,0.025240000337362,-1.9876532
KTPVVVGNCTGFAVNR,so,C,493,true,"S-sulfenylation site detection using YAP1C",110,32714340,,,,,,,,
TPVVVGNCTGFAVNR,so,C,493,true,"Arabidopsis S-sulfenylation chemoproteomics",108,31578252,"pFind PSM Score",0.0000358,,1.0136200,,,,0.3044022
TYKSMIIPLMQEDKR,ac,K,564,true,"Quantitative Acetylproteomics",101,29440448,,,,,,,,
SMIIPLMQEDK,ph,S,565,true,"Lateral root-induction - NAA vs control",106,23328941,"MASCOT Score",24.0000000,,,,,,
GFYLYDDKR,ac,K,591,true,"Quantitative Acetylproteomics",101,29440448,,,,,,,,
