Peptide,PTM,ModifiedAA,ModifiedPosition,PeptideUniqueToGene,ExperimentDesc,ExpID,PubmedID,ScoreType,IdentScore,LocProb,Log2FChange,PQ-val,QuantSig,PEP,MassErrorPPM
LHDVVVTGDNGTIDGQGLVWWDR,ng,N,86,false,"Conserved N-glycosylation",74,22633491,"MaxQuant Score",177.5100000,1.0000000,,,,0,0.7940000
SPYTIGIVPDSSDYVCIQNSTINVGYDAISLK,ng,N,175,true,"Conserved N-glycosylation",74,22633491,"MaxQuant Score",141.5700000,0.9350000,,,,8.6439996817432E-17,1.3290000
IGTAIVANGSFGSHPDDKYDVNALPLVSHIR,ng,N,279,true,"Conserved N-glycosylation",74,22633491,"MaxQuant Score",176.2300000,0.9980000,,,,1.4012984643248E-45,0.0200000
IGTAIVANGSFGSHPDDK,ng,N,279,true,"UDP-GlcNAc transporter glycopeptide analysis",135,30224661,,,,,,,0.00026708340737969,-3.0000000
LSNISGENIGIAGK,ng,N,305,true,"Conserved N-glycosylation",74,22633491,"MaxQuant Score",159.9300000,1.0000000,,,,1.3809999532217E-29,-0.2810000
LSNISGENIGIAGK,ng,N,305,true,"N-glycan occupancy Arabidopsis glycoproteins",87,23994444,"Ladder score",81.5000000,,,,,,
LSNISGENIGIAGK,ng,N,305,true,"N-linked Glycan Micro-heterogeneity Arabidopsis",134,29237727,,,,,,,,
LSNISGENIGIAGK,ng,N,305,true,"UDP-GlcNAc transporter glycopeptide analysis",135,30224661,,,,,,,5.285193723642E-12,-0.2000000
