Peptide,PTM,ModifiedAA,ModifiedPosition,PeptideUniqueToGene,ExperimentDesc,ExpID,PubmedID,ScoreType,IdentScore,LocProb,Log2FChange,PQ-val,QuantSig,PEP,MassErrorPPM
GAPEKSQSNTNSMQRVKVYHLNE,nt,G,2,true,"Arabidopsis translation initiation landscape - NT",167b,35069635,,,,,,,,
GAPEKSQSNTNSMQR,nt,G,2,true,"Arg/N-end rule pathway Roots",80,25728785,"MASCOT Score",32.2500000,,,,,9.8630000138655E-5,
GAPEKSQSNT,nt,G,2,true,"N-term acetylation drought responses",5,26184543,,,,,,,,
CSFLQNNVTEK,sno,C,511,true,"hot5-4 / wildtype, FAT-switch S-nitrosoproteome",169,37277371,,,,,,,,
YEQCLESAGPK,sno,C,629,true,"Site-specific nitrosomeproteomic id - gsnor1-3",90b,25699590,XCorr,2.8800000,,,,,0.05256000161171,-5.4900000
STSDAVDPR,ph,S,637,true,"atm and atr DNA damage response",88,25561503,"MASCOT Score",39.0000000,1.0000000,,,,,-0.1300000
EEEDYFNEDSDEEDSASASNTQK,ph,Y,660,true,"TOR Kinase and ABA Receptor",100,29290610,XCorr,6.3877563,0.9866000,,,,7.7309999824138E-7,
ALEKEEEDYFNEDSDEEDSASASNTQK,ph,S,665,true,"Large-scale phosphorylation discovery",44,23111157,XCorr,5.4150000,,,,,,
ALEKEEEDYFNEDSDEEDSASASNTQK,ph,S,665,true,"srk2dei ABA signaling phopshoproteomics",83,23572148,"MASCOT Score",93.0000000,,,,,,0.0020000
ALEKEEEDYFNEDSDEEDSASASNTQK,ph,S,665,true,"LAXIC - ABA stress",84a,23660473,XCorr,6.1000000,0.9930000,,,,0.00063633098034188,
ALEKEEEDYFNEDSDEEDSASASNTQK,ph,S,665,true,"LAXIC - mannitol vs control",84b,23660473,XCorr,6.5900000,0.9990000,,,,1.330000031885E-5,
ALEKEEEDYFNEDSDEEDSASASNTQK,ph,S,665,true,"SnRK2 protein kinase substrates",85,23776212,XCorr,5.5665483,1.0000000,,,,8.1109799798351E-16,
ALEKEEEDYFNEDSDEEDSASASNTQK,ph,S,665,true,"Col-0 callus - FC Col-0 vs. Col-0 Xray",111a,31410901,,68.7000000,,0.7883465,0.0151291,YES,,1.2172933
ALEKEEEDYFNEDSDEEDSASASNTQK,ph,S,665,true,"Col-0 X-ray callus - FC Col-0 vs. Col-0 Xray",111b,31410901,,68.7000000,,0.7883465,0.0151291,YES,,1.2172933
ALEKEEEDYFNEDSDEEDSASASNTQK,ph,S,665,true,"atm callus - FC atm vs. atm Xray",111c,31410901,,68.7000000,,0.5450933,0.1424246,NO,,1.2172933
ALEKEEEDYFNEDSDEEDSASASNTQK,ph,S,665,true,"atm-3 X-ray callus - FC atm vs. atm Xray",111d,31410901,,68.7000000,,0.5450933,0.1424246,NO,,1.2172933
EEEDYFNEDSDEEDSASASNTQK,ph,S,665,true,"srk2dei ABA signaling phopshoproteomics",83,23572148,"MASCOT Score",26.0000000,,,,,,-0.0028000
EEEDYFNEDSDEEDSASASNTQK,ph,S,665,true,"LAXIC - mannitol vs control",84b,23660473,XCorr,5.1100000,1.0000000,,,,1.8900000213762E-5,
EEEDYFNEDSDEEDSASASNTQK,ph,S,670,true,"srk2dei ABA signaling phopshoproteomics",83,23572148,"MASCOT Score",43.0000000,,,,,,0.0029000
EQPKPHLSNGVAASPTSSSPR,ph,S,701,true,"atm and atr DNA damage response",88,25561503,"MASCOT Score",45.0000000,0.9930000,,,,,-0.1800000
EQPKPHLSNGVAASPTSSSPR,ph,S,701,true,"Tissue atlas Arabidopsis - ProteomicsDB",114,32188942,"MaxQuant score",161.3100000,0.9999380,,,,4.7439600429694E-30,
EQPKPHLSNGVAASPTSSSPR,ph,S,706,true,"atm and atr DNA damage response",88,25561503,"MASCOT Score",50.0000000,0.8320000,,,,,-0.0400000
EQPKPHLSNGVAASPTSSSPR,ph,S,706,true,"Col-0 callus - FC Col-0 vs. Col-0 Xray",111a,31410901,,22.0400000,,0.4085935,0.0000000,NO,,0.9374833
EQPKPHLSNGVAASPTSSSPR,ph,S,706,true,"Col-0 X-ray callus - FC Col-0 vs. Col-0 Xray",111b,31410901,,22.0400000,,0.4085935,0.0000000,NO,,0.9374833
EQPKPHLSNGVAASPTSSSPR,ph,S,706,true,"atm callus - FC atm vs. atm Xray",111c,31410901,,22.0400000,,0.4846190,0.0000000,NO,,0.9374833
EQPKPHLSNGVAASPTSSSPR,ph,S,706,true,"atm-3 X-ray callus - FC atm vs. atm Xray",111d,31410901,,22.0400000,,0.4846190,0.0000000,NO,,0.9374833
EQPKPHLSNGVAASPTSSSPR,ph,S,706,true,"Tissue atlas Arabidopsis - ProteomicsDB",114,32188942,"MaxQuant score",161.6800000,0.9301000,,,,1.9174699585641E-30,
SGGLVDYEDDEDDEDYKPPPR,ph,S,709,true,"Tissue atlas Arabidopsis - ProteomicsDB",114,32188942,"MaxQuant score",163.6200000,1.0000000,,,,7.4476199955104E-30,
KQPEASEDEEGELLR,ph,S,735,true,"Tissue atlas Arabidopsis - ProteomicsDB",114,32188942,"MaxQuant score",148.1900000,1.0000000,,,,9.0821901110871E-9,
KSPGPAGSAAR,ph,S,791,true,"atm and atr DNA damage response",88,25561503,"MASCOT Score",43.0000000,1.0000000,,,,,-1.9000000
SPGPAGSAAR,ph,S,791,true,"atm and atr DNA damage response",88,25561503,"MASCOT Score",47.0000000,1.0000000,,,,,-0.7600000
SSPEMAVNGS,ph,S,857,true,"atm and atr DNA damage response",88,25561503,"MASCOT Score",35.0000000,0.9520000,,,,,-0.0500000
