Peptide,PTM,ModifiedAA,ModifiedPosition,PeptideUniqueToGene,ExperimentDesc,ExpID,PubmedID,ScoreType,IdentScore,LocProb,Log2FChange,PQ-val,QuantSig,PEP,MassErrorPPM
RVLDPEPDSDDGDEEIR,ph,S,161,true,"TOR Kinase and ABA Receptor",100,29290610,XCorr,5.3178458,1.0000000,,,,2.6269999509054E-8,
VLDPEPDSDDGDEEIR,ph,S,161,true,"STN8 phosphoproteome",38,21768351,"MASCOT Score",53.4000000,,,,,,-1.6709900
VLDPEPDSDDGDEEIR,ph,S,161,true,"LAXIC - ABA stress",84a,23660473,XCorr,2.9500000,1.0000000,,,,0.00034565399982966,
VLDPEPDSDDGDEEIR,ph,S,161,true,"LAXIC - mannitol vs control",84b,23660473,XCorr,2.6600000,1.0000000,,,,1.0200000360783E-5,
VLDPEPDSDDGDEEIR,ph,S,161,true,"SnRK2 protein kinase substrates",85,23776212,XCorr,2.7554271,1.0000000,,,,2.4615300490055E-15,
VLDPEPDSDDGDEEIR,ph,S,161,true,"atm and atr DNA damage response",88,25561503,"MASCOT Score",59.0000000,1.0000000,,,,,-0.3000000
VLDPEPDSDDGDEEIR,ph,S,161,true,"Phospho cell culture sucrose/TOR",109,30833711,,,1.0000000,,,,,
VLDPEPDSDDGDEEIR,ph,S,161,true,"Tissue atlas Arabidopsis - ProteomicsDB",114,32188942,"MaxQuant score",193.4700000,1.0000000,,,,1.3813400281364E-35,
VLDPEPDSDDGDEEIR,ph,S,161,true,"Touch-induced phosphorylation: 40s touch vs untouc",136,30291188,"MASCOT score",82.0100000,,-0.0327212,0.7084524,NO,,-1.6291042
SSSLEFPDGLPCPSSK,ph,S,259,true,"Tissue atlas Arabidopsis - ProteomicsDB",114,32188942,"MaxQuant score",144.2900000,0.9586810,,,,8.021779906997E-10,
