Peptide,PTM,ModifiedAA,ModifiedPosition,PeptideUniqueToGene,ExperimentDesc,ExpID,PubmedID,ScoreType,IdentScore,LocProb,Log2FChange,PQ-val,QuantSig,PEP,MassErrorPPM
ATGQLFSRNTQALFYN,nt,A,2,true,"Arg/N-end rule seed, prt6 vs. Wt",99,29168982,"MASCOT Score",63.0400000,,,,,6.2499999842203E-8,-1.7974466
ATGQLFSRNTQ,nt,A,2,true,"Arg/N-end rule seed, prt6 vs. Wt",99,29168982,"MASCOT Score",49.1300000,,,,,5.8649998209148E-6,-1.3410505
ATGQLFSRNT,nt,A,2,true,"N-term acetylation drought responses",5,26184543,,,,,,,,
ATGQLFSRN,nt,A,2,true,"Arg/N-end rule seed, prt6 vs. Wt",99,29168982,"MASCOT Score",48.0900000,,,,,0.00014699999883305,-0.1663470
ATGQLFSR,nt,A,2,false,"Stromal N-terminome",96,26371235,"MASCOT Score",53.9800000,,,,,,
ATGQLFSR,nt,A,2,false,"Arg/N-end rule seed, prt6 vs. Wt",99,29168982,"MASCOT Score",72.6900000,,,,,0.059900000691414,-1.8848919
ATGQLFSRNTQALFYNYKQLPIQRMLD,nta,A,2,true,"Arabidopsis translation initiation landscape - NTA",167a,35069635,,,,,,,,
ATGQLFSRNTQALFYN,nta,A,2,true,"Arg/N-end rule seed, prt6 vs. Wt",99,29168982,"MASCOT Score",63.0400000,,,,,6.2499999842203E-8,-1.7974466
ATGQLFSRNTQ,nta,A,2,true,"Arg/N-end rule seed, prt6 vs. Wt",99,29168982,"MASCOT Score",49.1300000,,,,,5.8649998209148E-6,-1.3410505
ATGQLFSRNT,nta,A,2,true,"N-term acetylation drought responses",5,26184543,,,,,,,,
ATGQLFSRN,nta,A,2,true,"Arg/N-end rule seed, prt6 vs. Wt",99,29168982,"MASCOT Score",48.0900000,,,,,0.00014699999883305,-0.1663470
ATGQLFSRN,nta,A,2,true,"HUNTER N-terminome: legumain, GluC and trypsin",119,31951383,"MaxQuant score",182.6500000,,,,,,
ATGQLFSR,nta,A,2,false,"Characterization plant N-terminal acetylation",6,22223895,"MASCOT Score",67.6600000,,,,,,
ATGQLFSR,nta,A,2,false,"Arg/N-end rule pathway Roots",80,25728785,"MASCOT Score",45.5200000,,,,,0.019969999790192,
ATGQLFSR,nta,A,2,false,"Stromal N-terminome",96,26371235,"MASCOT Score",53.9800000,,,,,,
ATGQLFSR,nta,A,2,false,"Arg/N-end rule seed, prt6 vs. Wt",99,29168982,"MASCOT Score",72.6900000,,,,,0.059900000691414,-1.8848919
ATGQLFSR,nta,A,2,false,"HUNTER N-terminome: legumain, GluC and trypsin",119,31951383,"MaxQuant score",184.4900000,,,,,,
NTQALFYNYKQLPIQR,ac,K,19,true,"Histone deacetylases - apicidin vs control",98a,29061669,"MaxQuant Score",144.3000000,1.0000000,0.0890000,0.6039486,NO,2.7999344615674E-41,
NTQALFYNYKQLPIQR,ac,K,19,true,"Histone deacetylases- hda14 vs WT (low light)",98c,29061669,"MaxQuant Score",106.1900000,1.0000000,-1.1350000,0.9885531,NO,8.0999998317566E-5,
NTQALFYNYKQLPIQR,ac,K,19,true,"Histone deacetylases substrates - hda14 vs WT",98e,29061669,"MaxQuant Score",107.5000000,1.0000000,-0.0720000,0.9289664,NO,3.8999998762355E-20,
IGDTAGTIDNIIQCK,ox,C,162,false,"SPEAR - 10 mM H2O2 / mock",138a,34619326,,,,2.8120659,0.0017037,YES,,
IGDTAGTIDNIIQCK,sno,C,162,false,"hot5-4 / wildtype, FAT-switch S-nitrosoproteome",169,37277371,,,,,,,,
IGDTAGTIDNIIQCK,so,C,162,false,"S-sulfenylation site detection using YAP1C",110,32714340,,,,,,,,
LYRPGSVGFVSKSGGMSNEMYNTIAR,ac,K,175,true,"Quantitative Acetylproteomics",101,29440448,,,,,,,,
LFKSEVQFGHAGAK,ac,K,266,false,"Histone deacetylases substrates - TSA vs control",98b,29061669,"MaxQuant Score",50.1000000,1.0000000,0.3680000,0.9794900,NO,0.0020000000949949,
LFKSEVQFGHAGAK,ac,K,266,false,"Quantitative Acetylproteomics",101,29440448,,,,,,,,
LVEEGKVSPIKEVTPPQIPEDLSSAIK,ph,S,324,true,"Large-scale phosphorylation discovery",44,23111157,XCorr,4.8590000,,,,,,
LVEEGKVSPIK,ph,S,324,false,"TOR Kinase and ABA Receptor",100,29290610,XCorr,3.6871583,1.0000000,,,,0.00043779998668469,
LVEEGKVSPIK,ph,S,324,false,"Tissue atlas Arabidopsis - ProteomicsDB",114,32188942,"MaxQuant score",115.3700000,1.0000000,,,,1.0643999530657E-6,
VSGAHNTIVTAR,nt,V,417,false,"Arg/N-end rule seed, prt6 vs. Wt",99,29168982,"MASCOT Score",27.1300000,,-1.5471753,0.0046042,YES,0.17430000007153,-0.4902975
SIGLIGH,nt,S,579,false,"Arg/N-end rule seed, prt6 vs. Wt",99,29168982,"MASCOT Score",51.1900000,,-0.1657485,0.6391907,NO,0.14669999480247,-0.9699282
