Peptide,PTM,ModifiedAA,ModifiedPosition,PeptideUniqueToGene,ExperimentDesc,ExpID,PubmedID,ScoreType,IdentScore,LocProb,Log2FChange,PQ-val,QuantSig,PEP,MassErrorPPM
ARNSNSDEAFSSEEEEER,ph,S,5,true,"atm and atr DNA damage response",88,25561503,"MASCOT Score",46.0000000,1.0000000,,,,,0.5400000
NSNSDEAFSSEEEEER,ph,S,7,true,"LAXIC - mannitol vs control",84b,23660473,XCorr,6.3000000,0.9440000,,,,4.3000000791257E-16,
NSNSDEAFSSEEEEER,ph,S,7,true,"Tissue atlas Arabidopsis - ProteomicsDB",114,32188942,"MaxQuant score",262.3700000,0.9999950,,,,0,
ARNSNSDEAFSSEEEEER,ph,S,12,true,"STN8 phosphoproteome",38,21768351,"MASCOT Score",49.8900000,,,,,,
ARNSNSDEAFSSEEEEER,ph,S,12,true,"atm and atr DNA damage response",88,25561503,"MASCOT Score",46.0000000,1.0000000,,,,,0.5400000
NSNSDEAFSSEEEEERVK,ph,S,12,true,"TOR Kinase and ABA Receptor",100,29290610,XCorr,4.6966262,1.0000000,,,,2.5400000595255E-5,
NSNSDEAFSSEEEEER,ph,S,12,true,"STN8 phosphoproteome",38,21768351,"MASCOT Score",57.3900000,,,,,,
NSNSDEAFSSEEEEER,ph,S,12,true,"srk2dei ABA signaling phopshoproteomics",83,23572148,"MASCOT Score",42.0000000,,,,,,-0.0016000
NSNSDEAFSSEEEEER,ph,S,12,true,"LAXIC - mannitol vs control",84b,23660473,XCorr,6.3000000,0.9440000,,,,4.3000000791257E-16,
NSNSDEAFSSEEEEER,ph,S,12,true,"atm and atr DNA damage response",88,25561503,"MASCOT Score",73.0000000,1.0000000,,,,,-0.4900000
NSNSDEAFSSEEEEER,ph,S,12,true,"Lateral root-induction - NAA vs control",106,23328941,"MASCOT Score",47.0000000,,,,,,
NSNSDEAFSSEEEEER,ph,S,12,true,"Tissue atlas Arabidopsis - ProteomicsDB",114,32188942,"MaxQuant score",316.2500000,1.0000000,,,,0,
ARNSNSDEAFSSEEEEER,ph,S,13,true,"atm and atr DNA damage response",88,25561503,"MASCOT Score",46.0000000,1.0000000,,,,,0.5400000
NSNSDEAFSSEEEEERVK,ph,S,13,true,"TOR Kinase and ABA Receptor",100,29290610,XCorr,4.6966262,1.0000000,,,,2.5400000595255E-5,
NSNSDEAFSSEEEEER,ph,S,13,true,"Tyrosine phosphorylation in Arabidopsis",59,18463617,"MASCOT Score",48.0000000,,,,,,-0.8773386
NSNSDEAFSSEEEEER,ph,S,13,true,"srk2dei ABA signaling phopshoproteomics",83,23572148,"MASCOT Score",42.0000000,,,,,,-0.0016000
NSNSDEAFSSEEEEER,ph,S,13,true,"LAXIC - ABA stress",84a,23660473,XCorr,5.7000000,0.9980000,,,,0.00053324899636209,
NSNSDEAFSSEEEEER,ph,S,13,true,"LAXIC - mannitol vs control",84b,23660473,XCorr,5.3400000,0.9980000,,,,4.3000000791257E-16,
NSNSDEAFSSEEEEER,ph,S,13,true,"SnRK2 protein kinase substrates",85,23776212,XCorr,5.2479196,0.9770000,,,,0.0061810100451112,
NSNSDEAFSSEEEEER,ph,S,13,true,"atm and atr DNA damage response",88,25561503,"MASCOT Score",73.0000000,1.0000000,,,,,-0.4900000
NSNSDEAFSSEEEEER,ph,S,13,true,"Lateral root-induction - NAA vs control",106,23328941,"MASCOT Score",34.0000000,,,,,,
NSNSDEAFSSEEEEER,ph,S,13,true,"Tissue atlas Arabidopsis - ProteomicsDB",114,32188942,"MaxQuant score",316.2500000,1.0000000,,,,0,
LLTQPSCIQGK,sno,C,184,true,"hot5-4 / wildtype, FAT-switch S-nitrosoproteome",169,37277371,,,,,,,,
KFTEDAIQFK,me2,K,699,false,"Arabidopsis protein methylome",123,31809900,"MaxQuant Score",99.5000000,1.0000000,,,,9.5069396799374E-11,0.1578200
NYSESEYFK,ph,S,751,true,"Tissue atlas Arabidopsis - ProteomicsDB",114,32188942,"MaxQuant score",87.7770000,0.9946740,,,,0.0027318398933858,
CDTLIR,so,C,997,false,"S-sulfenylation site detection using YAP1C",110,32714340,,,,,,,,
QASESPSSTKK,ph,S,1040,true,"atm and atr DNA damage response",88,25561503,"MASCOT Score",27.0000000,1.0000000,,,,,-2.4500000
QASESPSSTK,ph,S,1040,true,"atm and atr DNA damage response",88,25561503,"MASCOT Score",49.0000000,0.9950000,,,,,-1.1900000
QASESPSSTKK,ph,S,1042,true,"atm and atr DNA damage response",88,25561503,"MASCOT Score",27.0000000,1.0000000,,,,,-2.4500000
QASESPSSTK,ph,S,1042,true,"atm and atr DNA damage response",88,25561503,"MASCOT Score",53.0000000,0.9850000,,,,,-0.8400000
