Peptide,PTM,ModifiedAA,ModifiedPosition,PeptideUniqueToGene,ExperimentDesc,ExpID,PubmedID,ScoreType,IdentScore,LocProb,Log2FChange,PQ-val,QuantSig,PEP,MassErrorPPM
FSKLAEGTDITSAAPGVSLQKAR,nt,F,30,true,"Arg/N-end rule pathway Roots",80,25728785,"MASCOT Score",42.0500000,,,,,0.0056610000319779,
FSKLAEGTDITSAAPGVSLQKAR,nt,F,30,true,"HUNTER N-terminome: legumain, GluC and trypsin",119,31951383,"MaxQuant score",79.4450000,,,,,,
FSKLAEGTDITSAAPGVSLQKAR,nt,F,30,true,"Mitochondrial intermediate peptidases - icp55 / WT",131a,25732537,,140.2400000,,2.4645846,,,,
FSKLAEGTDITSAAPGVSLQKAR,nt,F,30,true,"Mitochondrial intermediate peptidases - oct1-1 / WT",131b,25732537,,137.8500000,,-0.2590120,,,,
FSKLAEGTDITSAAPGVSLQKAR,nt,F,30,true,"Mitochondrial intermediate peptidases - oct1-2 / WT",131c,25732537,,149.1100000,,-0.0254076,,,,
FSKLAEGTDITSAAPGVSLQKAR,nt,F,30,true,"Arabidopsis translation initiation landscape - NT",167b,35069635,,,,,,,,
SKLAEGTDITSAAPGVSLQKARSWD,nt,S,31,true,"HUNTER N-terminome: legumain, GluC and trypsin",119,31951383,"MaxQuant score",86.5510000,,,,,,
SKLAEGTDITSAAPGVSLQKAR,nt,S,31,true,"Arg/N-end rule pathway Roots",80,25728785,"MASCOT Score",86.4700000,,,,,1.1660000076574E-8,
SKLAEGTDITSAAPGVSLQKAR,nt,S,31,true,"Stromal N-terminome",96,26371235,"MASCOT Score",76.8500000,,,,,,
SKLAEGTDITSAAPGVSLQKAR,nt,S,31,true,"HUNTER N-terminome: legumain, GluC and trypsin",119,31951383,"MaxQuant score",122.4700000,,,,,,
SKLAEGTDITSAAPGVSLQKAR,nt,S,31,true,"Mitochondrial intermediate peptidases - icp55 / WT",131a,25732537,,134.4500000,,-3.6045207,,,,
SKLAEGTDITSAAPGVSLQKAR,nt,S,31,true,"Mitochondrial intermediate peptidases - oct1-1 / WT",131b,25732537,,131.3800000,,-0.3727260,,,,
SKLAEGTDITSAAPGVSLQKAR,nt,S,31,true,"Mitochondrial intermediate peptidases - oct1-2 / WT",131c,25732537,,132.1500000,,-0.1728993,,,,
SKLAEGTDITSAAPGVSLQKAR,nt,S,31,true,"Arabidopsis translation initiation landscape - NT",167b,35069635,,,,,,,,
SKLAEGTDITSAAPGVSLQKAR,nta,S,31,true,"FtsH12 N-terminome: WT / FtsH12 knockdown miRNA",118,33216923,"MaxQuant score",62.6770000,,,,,3.9399999105308E-13,
LAEGTDITSAAPGVSLQKAR,ac,K,50,true,"Quantitative Acetylproteomics",101,29440448,,,,,,,,
ARSWDEGVSSK,ph,S,53,true,"atm and atr DNA damage response",88,25561503,"MASCOT Score",37.0000000,1.0000000,,,,,0.4000000
ARSWDEGVSSK,ph,S,53,true,"TOR Kinase and ABA Receptor",100,29290610,XCorr,3.6435454,1.0000000,,,,0.0028480000328273,
ARSWDEGVSSK,ph,S,53,true,"Tissue atlas Arabidopsis - ProteomicsDB",114,32188942,"MaxQuant score",136.5700000,1.0000000,,,,3.5377399854042E-6,
VVIFGLPGAYTGVCSQQHVPSYK,ox,C,89,true,"OxiTRAQ SA and flg22 responses - SA vs mock",91a,25720653,"MASCOT Score",40.3300000,,1.0908534,0.0390000,YES,,
VVIFGLPGAYTGVCSQQHVPSYK,ox,C,89,true,"OxiTRAQ SA and flg22 responses - flg22 vs mock",91b,25720653,"MASCOT Score",40.3300000,,1.2448871,0.0460000,YES,,
VVIFGLPGAYTGVCSQQHVPSYK,ox,C,89,true,"Redox kickstart of mitochondria",112,31871212,,,,-0.4708111,0.0038201,YES,,
VVIFGLPGAYTGVCSQQHVPSYK,so,C,89,true,"S-sulfenylation site detection using YAP1C",110,32714340,,,,,,,,
SHIDKFK,ac,K,103,true,"Quantitative Acetylproteomics",101,29440448,,,,,,,,
GIDSVICVSVNDPFAINGWAEK,ox,C,114,true,"Redox kickstart of mitochondria",112,31871212,,,,-1.3154278,0.0004812,YES,,
DAIEFYGDFDGK,ph,Y,139,true,"SIRK1 phosphorylation",86a,23820729,"MaxQuant Score",44.2830000,1.0000000,,,,1.1749999523163,0.7920000
FHKSLGLDK,ac,K,148,true,"Quantitative Acetylproteomics",101,29440448,,,,,,,,
SLGLDKDLSAALLGPR,nt,S,149,true,"N-terminal ChaFRADIC",92,26010716,"MASCOT Score",25.5300000,,,,,2.1470000319823E-6,
